BDBM50391860 CHEMBL2147283
SMILES: CN(Cc1ccc(F)cc1)C(=O)[C@@H](NC(=O)c1ccc2nc(NC(=O)c3ccccc3-c3ccc(C)cc3)ccc2c1)c1ccccc1
InChI Key: InChIKey=OUNZFDMRSCNFLA-QNGWXLTQSA-N
Data: 2 IC50
Activity Spreadsheet -- Enzyme Inhibition Constant Data from BindingDB
Found 2 hits for monomerid = 50391860
Trg + Lig
Ki
nM
ΔG°
kcal/mole
IC50
nM
Kd
nM
EC50/IC50
nM
koff
s-1
kon
M-1s-1
pHTemp
°C
Microsomal triglyceride transfer protein
(Homo sapiens (Human))
BDBM50391860
(CHEMBL2147283)
Show SMILES CN(Cc1ccc(F)cc1)C(=O)[C@@H](NC(=O)c1ccc2nc(NC(=O)c3ccccc3-c3ccc(C)cc3)ccc2c1)c1ccccc1 |r|
Show InChI InChI=1S/C40H33FN4O3/c1-26-12-16-28(17-13-26)33-10-6-7-11-34(33)39(47)43-36-23-19-30-24-31(18-22-35(30)42-36)38(46)44-37(29-8-4-3-5-9-29)40(48)45(2)25-27-14-20-32(41)21-15-27/h3-24,37H,25H2,1-2H3,(H,44,46)(H,42,43,47)/t37-/m0/s1
Reactome pathway
n/an/a 2.20n/an/an/an/an/an/a
Pfizer Inc.
Curated by ChEMBL
Assay Description
Inhibition of MTP in human HepG2 cells assessed as inhibition of apoB secretion after 40 hrs by ELISA
Bioorg Med Chem Lett 21: 4150-4 (2011)
Article DOI: 10.1016/j.bmcl.2011.05.099
BindingDB Entry DOI: 10.7270/Q2B27WCR
Microsomal triglyceride transfer protein
(Homo sapiens (Human))
BDBM50391860
(CHEMBL2147283)
Show SMILES CN(Cc1ccc(F)cc1)C(=O)[C@@H](NC(=O)c1ccc2nc(NC(=O)c3ccccc3-c3ccc(C)cc3)ccc2c1)c1ccccc1 |r|
Show InChI InChI=1S/C40H33FN4O3/c1-26-12-16-28(17-13-26)33-10-6-7-11-34(33)39(47)43-36-23-19-30-24-31(18-22-35(30)42-36)38(46)44-37(29-8-4-3-5-9-29)40(48)45(2)25-27-14-20-32(41)21-15-27/h3-24,37H,25H2,1-2H3,(H,44,46)(H,42,43,47)/t37-/m0/s1
Reactome pathway
n/an/a 9.5n/an/an/an/an/an/a
Pfizer Inc.
Curated by ChEMBL
Assay Description
Inhibition of MTP in human HepG2 cells assessed as unbound drug level causing inhibition of apoB secretion after 40 hrs by ELISA
Bioorg Med Chem Lett 21: 4150-4 (2011)
Article DOI: 10.1016/j.bmcl.2011.05.099
BindingDB Entry DOI: 10.7270/Q2B27WCR