BDBM50391983 CHEMBL2152419
SMILES: C(N[C@H]1CC[C@@H](CC1)n1cnc2cnc3[nH]ccc3c12)C1CC1
InChI Key: InChIKey=MNTLGGLAJJAYBI-HDJSIYSDSA-N
Data: 1 KI  1 EC50
Activity Spreadsheet -- Enzyme Inhibition Constant Data from BindingDB
Found 2 hits for monomerid = 50391983
Trg + Lig
Ki
nM
ΔG°
kcal/mole
IC50
nM
Kd
nM
EC50/IC50
nM
koff
s-1
kon
M-1s-1
pHTemp
°C
Tyrosine-protein kinase JAK1
(Homo sapiens (Human))
BDBM50391983
(CHEMBL2152419)
Show SMILES C(N[C@H]1CC[C@@H](CC1)n1cnc2cnc3[nH]ccc3c12)C1CC1 |r,wU:2.1,wD:5.8,(42.82,-9.5,;41.29,-9.49,;40.51,-10.81,;41.27,-12.15,;40.49,-13.48,;38.95,-13.47,;38.18,-12.14,;38.97,-10.81,;38.18,-14.8,;36.66,-14.64,;36.04,-16.04,;37.17,-17.06,;37.17,-18.61,;38.51,-19.38,;39.84,-18.6,;41.3,-19.08,;42.21,-17.83,;41.3,-16.58,;39.84,-17.06,;38.5,-16.3,;43.6,-8.17,;44.93,-7.41,;43.61,-6.63,)|
Show InChI InChI=1S/C18H23N5/c1-2-12(1)9-20-13-3-5-14(6-4-13)23-11-22-16-10-21-18-15(17(16)23)7-8-19-18/h7-8,10-14,20H,1-6,9H2,(H,19,21)/t13-,14-
Reactome pathway
9.30n/an/an/an/an/an/an/an/a
Argenta Discovery Ltd.
Curated by ChEMBL
Assay Description
Inhibition of JAK1
J Med Chem 55: 5901-21 (2012)
Article DOI: 10.1021/jm300438j
BindingDB Entry DOI: 10.7270/Q2DV1KZX
Tyrosine-protein kinase JAK1
(Homo sapiens (Human))
BDBM50391983
(CHEMBL2152419)
Show SMILES C(N[C@H]1CC[C@@H](CC1)n1cnc2cnc3[nH]ccc3c12)C1CC1 |r,wU:2.1,wD:5.8,(42.82,-9.5,;41.29,-9.49,;40.51,-10.81,;41.27,-12.15,;40.49,-13.48,;38.95,-13.47,;38.18,-12.14,;38.97,-10.81,;38.18,-14.8,;36.66,-14.64,;36.04,-16.04,;37.17,-17.06,;37.17,-18.61,;38.51,-19.38,;39.84,-18.6,;41.3,-19.08,;42.21,-17.83,;41.3,-16.58,;39.84,-17.06,;38.5,-16.3,;43.6,-8.17,;44.93,-7.41,;43.61,-6.63,)|
Show InChI InChI=1S/C18H23N5/c1-2-12(1)9-20-13-3-5-14(6-4-13)23-11-22-16-10-21-18-15(17(16)23)7-8-19-18/h7-8,10-14,20H,1-6,9H2,(H,19,21)/t13-,14-
Reactome pathway
n/an/an/an/a 130n/an/an/an/a
Argenta Discovery Ltd.
Curated by ChEMBL
Assay Description
Inhibition of JAK1 in human TF1 cells assessed as inhibition of IL2-induced STAT3 phosphorylation
J Med Chem 55: 5901-21 (2012)
Article DOI: 10.1021/jm300438j
BindingDB Entry DOI: 10.7270/Q2DV1KZX