BDBM50392001 CHEMBL2152305
SMILES: C(N1CCC(CC1)n1cnc2cnc3[nH]ccc3c12)c1ccccc1
InChI Key: InChIKey=WKWXJWGOAKGEEM-UHFFFAOYSA-N
Data: 4 KI  1 EC50
PDB links: 1 PDB ID matches this monomer.
Activity Spreadsheet -- Enzyme Inhibition Constant Data from BindingDB
Found 5 hits for monomerid = 50392001
Trg + Lig
Ki
nM
ΔG°
kcal/mole
IC50
nM
Kd
nM
EC50/IC50
nM
koff
s-1
kon
M-1s-1
pHTemp
°C
Tyrosine-protein kinase JAK1
(Homo sapiens (Human))
BDBM50392001
(CHEMBL2152305)
Show SMILES C(N1CCC(CC1)n1cnc2cnc3[nH]ccc3c12)c1ccccc1
Show InChI InChI=1S/C20H21N5/c1-2-4-15(5-3-1)13-24-10-7-16(8-11-24)25-14-23-18-12-22-20-17(19(18)25)6-9-21-20/h1-6,9,12,14,16H,7-8,10-11,13H2,(H,21,22)
Reactome pathway
2.40n/an/an/an/an/an/an/an/a
Argenta Discovery Ltd.
Curated by ChEMBL
Assay Description
Inhibition of JAK1
J Med Chem 55: 5901-21 (2012)
Article DOI: 10.1021/jm300438j
BindingDB Entry DOI: 10.7270/Q2DV1KZX
Tyrosine-protein kinase JAK2
(Homo sapiens (Human))
BDBM50392001
(CHEMBL2152305)
Show SMILES C(N1CCC(CC1)n1cnc2cnc3[nH]ccc3c12)c1ccccc1
Show InChI InChI=1S/C20H21N5/c1-2-4-15(5-3-1)13-24-10-7-16(8-11-24)25-14-23-18-12-22-20-17(19(18)25)6-9-21-20/h1-6,9,12,14,16H,7-8,10-11,13H2,(H,21,22)
Reactome pathway
4.40n/an/an/an/an/an/an/an/a
Argenta Discovery Ltd.
Curated by ChEMBL
Assay Description
Inhibition of JAK2
J Med Chem 55: 5901-21 (2012)
Article DOI: 10.1021/jm300438j
BindingDB Entry DOI: 10.7270/Q2DV1KZX
3D
3D Structure (crystal)
Tyrosine-protein kinase JAK3
(Homo sapiens (Human))
BDBM50392001
(CHEMBL2152305)
Show SMILES C(N1CCC(CC1)n1cnc2cnc3[nH]ccc3c12)c1ccccc1
Show InChI InChI=1S/C20H21N5/c1-2-4-15(5-3-1)13-24-10-7-16(8-11-24)25-14-23-18-12-22-20-17(19(18)25)6-9-21-20/h1-6,9,12,14,16H,7-8,10-11,13H2,(H,21,22)
Reactome pathway
33n/an/an/an/an/an/an/an/a
Argenta Discovery Ltd.
Curated by ChEMBL
Assay Description
Inhibition of JAK3
J Med Chem 55: 5901-21 (2012)
Article DOI: 10.1021/jm300438j
BindingDB Entry DOI: 10.7270/Q2DV1KZX
Non-receptor tyrosine-protein kinase TYK2
(Homo sapiens (Human))
BDBM50392001
(CHEMBL2152305)
Show SMILES C(N1CCC(CC1)n1cnc2cnc3[nH]ccc3c12)c1ccccc1
Show InChI InChI=1S/C20H21N5/c1-2-4-15(5-3-1)13-24-10-7-16(8-11-24)25-14-23-18-12-22-20-17(19(18)25)6-9-21-20/h1-6,9,12,14,16H,7-8,10-11,13H2,(H,21,22)
85n/an/an/an/an/an/an/an/a
Argenta Discovery Ltd.
Curated by ChEMBL
Assay Description
Inhibition of TYK2
J Med Chem 55: 5901-21 (2012)
Article DOI: 10.1021/jm300438j
BindingDB Entry DOI: 10.7270/Q2DV1KZX
Tyrosine-protein kinase JAK1
(Homo sapiens (Human))
BDBM50392001
(CHEMBL2152305)
Show SMILES C(N1CCC(CC1)n1cnc2cnc3[nH]ccc3c12)c1ccccc1
Show InChI InChI=1S/C20H21N5/c1-2-4-15(5-3-1)13-24-10-7-16(8-11-24)25-14-23-18-12-22-20-17(19(18)25)6-9-21-20/h1-6,9,12,14,16H,7-8,10-11,13H2,(H,21,22)
Reactome pathway
n/an/an/an/a 86n/an/an/an/a
Argenta Discovery Ltd.
Curated by ChEMBL
Assay Description
Inhibition of JAK1 in human TF1 cells assessed as inhibition of IL2-induced STAT3 phosphorylation
J Med Chem 55: 5901-21 (2012)
Article DOI: 10.1021/jm300438j
BindingDB Entry DOI: 10.7270/Q2DV1KZX