BDBM50392020 CHEMBL2152413
SMILES: CC(C)(C)OC(=O)N[C@H]1CC[C@H](CC1)n1cnc2cnc3[nH]ccc3c12
InChI Key: InChIKey=VBEGYGRCLFKGNY-BETUJISGSA-N
Data: 1 KI  1 EC50
Activity Spreadsheet -- Enzyme Inhibition Constant Data from BindingDB
Found 2 hits for monomerid = 50392020
Trg + Lig
Ki
nM
ΔG°
kcal/mole
IC50
nM
Kd
nM
EC50/IC50
nM
koff
s-1
kon
M-1s-1
pHTemp
°C
Tyrosine-protein kinase JAK1
(Homo sapiens (Human))
BDBM50392020
(CHEMBL2152413)
Show SMILES CC(C)(C)OC(=O)N[C@H]1CC[C@H](CC1)n1cnc2cnc3[nH]ccc3c12 |r,wD:11.14,8.7,(-.89,-10.06,;-1.65,-8.72,;-.88,-7.39,;-.12,-8.72,;-3.19,-8.71,;-3.96,-7.37,;-3.18,-6.04,;-5.49,-7.36,;-6.27,-8.69,;-7.82,-8.68,;-8.6,-10.01,;-7.83,-11.34,;-6.29,-11.35,;-5.51,-10.03,;-8.6,-12.67,;-10.13,-12.52,;-10.75,-13.92,;-9.61,-14.94,;-9.61,-16.48,;-8.27,-17.25,;-6.94,-16.47,;-5.48,-16.95,;-4.57,-15.7,;-5.48,-14.46,;-6.94,-14.93,;-8.28,-14.17,)|
Show InChI InChI=1S/C19H25N5O2/c1-19(2,3)26-18(25)23-12-4-6-13(7-5-12)24-11-22-15-10-21-17-14(16(15)24)8-9-20-17/h8-13H,4-7H2,1-3H3,(H,20,21)(H,23,25)/t12-,13+
Reactome pathway
6.10n/an/an/an/an/an/an/an/a
Argenta Discovery Ltd.
Curated by ChEMBL
Assay Description
Inhibition of JAK1
J Med Chem 55: 5901-21 (2012)
Article DOI: 10.1021/jm300438j
BindingDB Entry DOI: 10.7270/Q2DV1KZX
Tyrosine-protein kinase JAK1
(Homo sapiens (Human))
BDBM50392020
(CHEMBL2152413)
Show SMILES CC(C)(C)OC(=O)N[C@H]1CC[C@H](CC1)n1cnc2cnc3[nH]ccc3c12 |r,wD:11.14,8.7,(-.89,-10.06,;-1.65,-8.72,;-.88,-7.39,;-.12,-8.72,;-3.19,-8.71,;-3.96,-7.37,;-3.18,-6.04,;-5.49,-7.36,;-6.27,-8.69,;-7.82,-8.68,;-8.6,-10.01,;-7.83,-11.34,;-6.29,-11.35,;-5.51,-10.03,;-8.6,-12.67,;-10.13,-12.52,;-10.75,-13.92,;-9.61,-14.94,;-9.61,-16.48,;-8.27,-17.25,;-6.94,-16.47,;-5.48,-16.95,;-4.57,-15.7,;-5.48,-14.46,;-6.94,-14.93,;-8.28,-14.17,)|
Show InChI InChI=1S/C19H25N5O2/c1-19(2,3)26-18(25)23-12-4-6-13(7-5-12)24-11-22-15-10-21-17-14(16(15)24)8-9-20-17/h8-13H,4-7H2,1-3H3,(H,20,21)(H,23,25)/t12-,13+
Reactome pathway
n/an/an/an/a 500n/an/an/an/a
Argenta Discovery Ltd.
Curated by ChEMBL
Assay Description
Inhibition of JAK1 in human TF1 cells assessed as inhibition of IL2-induced STAT3 phosphorylation
J Med Chem 55: 5901-21 (2012)
Article DOI: 10.1021/jm300438j
BindingDB Entry DOI: 10.7270/Q2DV1KZX