null
SMILES: NC(=O)c1ccccc1Nc1cccc(c1)C(F)(F)F
InChI Key: InChIKey=YOOQXVNSJQLHRB-UHFFFAOYSA-N
Activity Spreadsheet -- Enzyme Inhibition Constant Data from BindingDB
Found 1 hit for monomerid = 50392063
Trg + Lig
Ki
nM
ΔG°
kcal/mole
IC50
nM
Kd
nM
EC50/IC50
nM
koff
s-1
kon
M-1s-1
pHTemp
°C
NAD-dependent protein deacetylase sirtuin-2
(Homo sapiens (Human))
BDBM50392063
(CHEMBL2152567)
Show SMILES NC(=O)c1ccccc1Nc1cccc(c1)C(F)(F)F
Show InChI InChI=1S/C14H11F3N2O/c15-14(16,17)9-4-3-5-10(8-9)19-12-7-2-1-6-11(12)13(18)20/h1-8,19H,(H2,18,20)
NCI pathway
n/an/a 1.00E+5n/an/an/an/an/an/a
Kyoto Prefectural University of Medicine
Curated by ChEMBL
Assay Description
Inhibition of human recombinant SIRT2 using Fluor de Lys-SIRT as substrate incubated for 60 mins prior to substrate addition measured after 60 mins b...
J Med Chem 55: 5760-73 (2012)
Article DOI: 10.1021/jm3002108
BindingDB Entry DOI: 10.7270/Q2WW7JRS