BDBM50392075 CHEMBL2152578
SMILES: NC(=O)c1ccccc1Nc1ccc(cc1)C#N
InChI Key: InChIKey=ZKBXRAZMGYCNSL-UHFFFAOYSA-N
Data: 1 IC50
Activity Spreadsheet -- Enzyme Inhibition Constant Data from BindingDB
Found 1 hit for monomerid = 50392075
Trg + Lig
Ki
nM
ΔG°
kcal/mole
IC50
nM
Kd
nM
EC50/IC50
nM
koff
s-1
kon
M-1s-1
pHTemp
°C
NAD-dependent deacetylase sirtuin 2
(Homo sapiens (Human))
BDBM50392075
(CHEMBL2152578)
Show SMILES NC(=O)c1ccccc1Nc1ccc(cc1)C#N
Show InChI InChI=1S/C14H11N3O/c15-9-10-5-7-11(8-6-10)17-13-4-2-1-3-12(13)14(16)18/h1-8,17H,(H2,16,18)
NCI pathway
n/an/a 9.30E+4n/an/an/an/an/an/a
Kyoto Prefectural University of Medicine
Curated by ChEMBL
Assay Description
Inhibition of human recombinant SIRT2 using Fluor de Lys-SIRT as substrate incubated for 60 mins prior to substrate addition measured after 60 mins b...
J Med Chem 55: 5760-73 (2012)
Article DOI: 10.1021/jm3002108
BindingDB Entry DOI: 10.7270/Q2WW7JRS