null
SMILES: CN(C(=O)c1cccc(Nc2ccccc2C(N)=O)c1)c1ccccc1
InChI Key: InChIKey=IPOVTZRSZUTGDI-UHFFFAOYSA-N
Activity Spreadsheet -- Enzyme Inhibition Constant Data from BindingDB
Found 2 hits for monomerid = 50392101
Trg + Lig
Ki
nM
ΔG°
kcal/mole
IC50
nM
Kd
nM
EC50/IC50
nM
koff
s-1
kon
M-1s-1
pHTemp
°C
NAD-dependent protein deacetylase sirtuin-1
(Homo sapiens (Human))
BDBM50392101
(CHEMBL2152603)
Show SMILES CN(C(=O)c1cccc(Nc2ccccc2C(N)=O)c1)c1ccccc1
Show InChI InChI=1S/C21H19N3O2/c1-24(17-10-3-2-4-11-17)21(26)15-8-7-9-16(14-15)23-19-13-6-5-12-18(19)20(22)25/h2-14,23H,1H3,(H2,22,25)
NCI pathway
Reactome pathway
n/an/a>1.00E+5n/an/an/an/an/an/a
Kyoto Prefectural University of Medicine
Curated by ChEMBL
Assay Description
Inhibition of human recombinant SIRT1 using Fluor de Lys-SIRT as substrate incubated for 60 mins prior to substrate addition measured after 60 mins b...
J Med Chem 55: 5760-73 (2012)
Article DOI: 10.1021/jm3002108
BindingDB Entry DOI: 10.7270/Q2WW7JRS
NAD-dependent protein deacetylase sirtuin-2
(Homo sapiens (Human))
BDBM50392101
(CHEMBL2152603)
Show SMILES CN(C(=O)c1cccc(Nc2ccccc2C(N)=O)c1)c1ccccc1
Show InChI InChI=1S/C21H19N3O2/c1-24(17-10-3-2-4-11-17)21(26)15-8-7-9-16(14-15)23-19-13-6-5-12-18(19)20(22)25/h2-14,23H,1H3,(H2,22,25)
NCI pathway
n/an/a>1.00E+5n/an/an/an/an/an/a
Kyoto Prefectural University of Medicine
Curated by ChEMBL
Assay Description
Inhibition of human recombinant SIRT2 using Fluor de Lys-SIRT as substrate incubated for 60 mins prior to substrate addition measured after 60 mins b...
J Med Chem 55: 5760-73 (2012)
Article DOI: 10.1021/jm3002108
BindingDB Entry DOI: 10.7270/Q2WW7JRS