BDBM50392279 CHEMBL2153647
SMILES: [#8]-[#6](=O)-[#6@H](-[#6]-[#6]-[#6](=O)-[#7]-1-[#6]-[#6]-[#7](-[#6]-[#6]-1)-c1cccc(c1)\[#7]=[#6]-1/[#7]-[#6]-[#6]-[#6]-[#7]-1)-[#7]-[#6](=O)-[#8]-[#6]-c1ccc(cc1)-[#6](-[#8])=O
InChI Key: InChIKey=MRXQBHPWVQTUKZ-QHCPKHFHSA-N
Data: 4 IC50
Activity Spreadsheet -- Enzyme Inhibition Constant Data from BindingDB
Found 4 hits for monomerid = 50392279
Trg + Lig
Ki
nM
ΔG°
kcal/mole
IC50
nM
Kd
nM
EC50/IC50
nM
koff
s-1
kon
M-1s-1
pHTemp
°C
ITGAV/ITGB3
(Homo sapiens (Human))
BDBM50392279
(CHEMBL2153647)
Show SMILES [#8]-[#6](=O)-[#6@H](-[#6]-[#6]-[#6](=O)-[#7]-1-[#6]-[#6]-[#7](-[#6]-[#6]-1)-c1cccc(c1)\[#7]=[#6]-1/[#7]-[#6]-[#6]-[#6]-[#7]-1)-[#7]-[#6](=O)-[#8]-[#6]-c1ccc(cc1)-[#6](-[#8])=O |r|
Show InChI InChI=1S/C28H34N6O7/c35-24(10-9-23(26(38)39)32-28(40)41-18-19-5-7-20(8-6-19)25(36)37)34-15-13-33(14-16-34)22-4-1-3-21(17-22)31-27-29-11-2-12-30-27/h1,3-8,17,23H,2,9-16,18H2,(H,32,40)(H,36,37)(H,38,39)(H2,29,30,31)/t23-/m0/s1
n/an/a 0.0820n/an/an/an/an/an/a
sigma-tau Industrie Farmaceutiche Riunite SpA
Curated by ChEMBL
Assay Description
Displacement of [125I]echistatin from integrin alpha5beta3 after 3 hrs by gamma counter
Bioorg Med Chem Lett 22: 6509-12 (2012)
Article DOI: 10.1016/j.bmcl.2012.07.061
BindingDB Entry DOI: 10.7270/Q2GM88DW
ITGAV/ITGB3
(Homo sapiens (Human))
BDBM50392279
(CHEMBL2153647)
Show SMILES [#8]-[#6](=O)-[#6@H](-[#6]-[#6]-[#6](=O)-[#7]-1-[#6]-[#6]-[#7](-[#6]-[#6]-1)-c1cccc(c1)\[#7]=[#6]-1/[#7]-[#6]-[#6]-[#6]-[#7]-1)-[#7]-[#6](=O)-[#8]-[#6]-c1ccc(cc1)-[#6](-[#8])=O |r|
Show InChI InChI=1S/C28H34N6O7/c35-24(10-9-23(26(38)39)32-28(40)41-18-19-5-7-20(8-6-19)25(36)37)34-15-13-33(14-16-34)22-4-1-3-21(17-22)31-27-29-11-2-12-30-27/h1,3-8,17,23H,2,9-16,18H2,(H,32,40)(H,36,37)(H,38,39)(H2,29,30,31)/t23-/m0/s1
n/an/a 6.30n/an/an/an/an/an/a
sigma-tau Industrie Farmaceutiche Riunite SpA
Curated by ChEMBL
Assay Description
Inhibition of vitronectin binding to human alphaVbeta3 integrin expressed in PC3 cells
Bioorg Med Chem Lett 22: 6509-12 (2012)
Article DOI: 10.1016/j.bmcl.2012.07.061
BindingDB Entry DOI: 10.7270/Q2GM88DW
ITGAV/ITGB3
(Homo sapiens (Human))
BDBM50392279
(CHEMBL2153647)
Show SMILES [#8]-[#6](=O)-[#6@H](-[#6]-[#6]-[#6](=O)-[#7]-1-[#6]-[#6]-[#7](-[#6]-[#6]-1)-c1cccc(c1)\[#7]=[#6]-1/[#7]-[#6]-[#6]-[#6]-[#7]-1)-[#7]-[#6](=O)-[#8]-[#6]-c1ccc(cc1)-[#6](-[#8])=O |r|
Show InChI InChI=1S/C28H34N6O7/c35-24(10-9-23(26(38)39)32-28(40)41-18-19-5-7-20(8-6-19)25(36)37)34-15-13-33(14-16-34)22-4-1-3-21(17-22)31-27-29-11-2-12-30-27/h1,3-8,17,23H,2,9-16,18H2,(H,32,40)(H,36,37)(H,38,39)(H2,29,30,31)/t23-/m0/s1
n/an/a 17n/an/an/an/an/an/a
sigma-tau Industrie Farmaceutiche Riunite SpA
Curated by ChEMBL
Assay Description
Inhibition of vitronectin binding to human alphaVbeta3 integrin over expressed in A2780 cells
Bioorg Med Chem Lett 22: 6509-12 (2012)
Article DOI: 10.1016/j.bmcl.2012.07.061
BindingDB Entry DOI: 10.7270/Q2GM88DW
ITGAV/ITGB5
(Homo sapiens (Human))
BDBM50392279
(CHEMBL2153647)
Show SMILES [#8]-[#6](=O)-[#6@H](-[#6]-[#6]-[#6](=O)-[#7]-1-[#6]-[#6]-[#7](-[#6]-[#6]-1)-c1cccc(c1)\[#7]=[#6]-1/[#7]-[#6]-[#6]-[#6]-[#7]-1)-[#7]-[#6](=O)-[#8]-[#6]-c1ccc(cc1)-[#6](-[#8])=O |r|
Show InChI InChI=1S/C28H34N6O7/c35-24(10-9-23(26(38)39)32-28(40)41-18-19-5-7-20(8-6-19)25(36)37)34-15-13-33(14-16-34)22-4-1-3-21(17-22)31-27-29-11-2-12-30-27/h1,3-8,17,23H,2,9-16,18H2,(H,32,40)(H,36,37)(H,38,39)(H2,29,30,31)/t23-/m0/s1
NCI pathway
Reactome pathway
n/an/a 2.20n/an/an/an/an/an/a
sigma-tau Industrie Farmaceutiche Riunite SpA
Curated by ChEMBL
Assay Description
Displacement of [125I]echistatin from integrin alpha5beta5 after 3 hrs by gamma counter
Bioorg Med Chem Lett 22: 6509-12 (2012)
Article DOI: 10.1016/j.bmcl.2012.07.061
BindingDB Entry DOI: 10.7270/Q2GM88DW