BDBM50392311 CHEMBL2153651
SMILES: CN=C(NS(=O)(=O)c1ccc(cc1)C(=O)NO)N1CC(C(=N1)c1ccc(Cl)cc1)c1ccccc1
InChI Key: InChIKey=CPIGXCGOUUAVFD-UHFFFAOYSA-N
Data: 1 IC50
Activity Spreadsheet -- Enzyme Inhibition Constant Data from BindingDB
Found 1 hit for monomerid = 50392311
Trg + Lig
Ki
nM
ΔG°
kcal/mole
IC50
nM
Kd
nM
EC50/IC50
nM
koff
s-1
kon
M-1s-1
pHTemp
°C
Cannabinoid receptor 1
(Homo sapiens (Human))
BDBM50392311
(CHEMBL2153651)
Show SMILES CN=C(NS(=O)(=O)c1ccc(cc1)C(=O)NO)N1CC(C(=N1)c1ccc(Cl)cc1)c1ccccc1 |w:1.0,c:21|
Show InChI InChI=1S/C24H22ClN5O4S/c1-26-24(29-35(33,34)20-13-9-18(10-14-20)23(31)28-32)30-15-21(16-5-3-2-4-6-16)22(27-30)17-7-11-19(25)12-8-17/h2-14,21,32H,15H2,1H3,(H,26,29)(H,28,31)
NCI pathway
Reactome pathway
n/an/a>5.00E+3n/an/an/an/an/an/a
Jenrin Discovery
Curated by ChEMBL
Assay Description
Displacement of 3[H]ligand from recombinant human CB1 receptor
Bioorg Med Chem Lett 22: 6173-80 (2012)
Article DOI: 10.1016/j.bmcl.2012.08.004
BindingDB Entry DOI: 10.7270/Q2BV7HR2