BDBM50392488 CHEMBL2152058
SMILES: CCNC(N)=NCCC[C@H](NC(=O)[C@H](CC(C)C)NC(=O)CNC(=O)[C@H](Cc1ccccc1)NC(=O)[C@H](CO)NC(=O)[C@H](CC(N)=O)NC(=O)[C@H](Cc1c[nH]c2ccccc12)NC(=O)[C@H](CC(N)=O)NC(=O)[C@@H](N)Cc1ccc(O)cc1)C(=O)N[C@@H](Cc1ccccc1)C(N)=O
InChI Key: InChIKey=ZCGGUNQXSKCRFX-NSWSVTGLSA-N
Data: 1 EC50
Activity Spreadsheet -- Enzyme Inhibition Constant Data from BindingDB
Found 1 hit for monomerid = 50392488
Trg + Lig
Ki
nM
ΔG°
kcal/mole
IC50
nM
Kd
nM
EC50/IC50
nM
koff
s-1
kon
M-1s-1
pHTemp
°C
G-protein Coupled Receptor 54
(Homo sapiens (Human))
BDBM50392488
(CHEMBL2152058)
Show SMILES CCNC(N)=NCCC[C@H](NC(=O)[C@H](CC(C)C)NC(=O)CNC(=O)[C@H](Cc1ccccc1)NC(=O)[C@H](CO)NC(=O)[C@H](CC(N)=O)NC(=O)[C@H](Cc1c[nH]c2ccccc12)NC(=O)[C@H](CC(N)=O)NC(=O)[C@@H](N)Cc1ccc(O)cc1)C(=O)N[C@@H](Cc1ccccc1)C(N)=O |r,w:5.5|
Show InChI InChI=1S/C65H87N17O14/c1-4-71-65(70)72-25-13-20-45(59(91)77-46(56(69)88)28-37-14-7-5-8-15-37)76-60(92)47(26-36(2)3)75-55(87)34-74-58(90)48(29-38-16-9-6-10-17-38)79-64(96)52(35-83)82-63(95)51(32-54(68)86)81-61(93)49(30-40-33-73-44-19-12-11-18-42(40)44)80-62(94)50(31-53(67)85)78-57(89)43(66)27-39-21-23-41(84)24-22-39/h5-12,14-19,21-24,33,36,43,45-52,73,83-84H,4,13,20,25-32,34-35,66H2,1-3H3,(H2,67,85)(H2,68,86)(H2,69,88)(H,74,90)(H,75,87)(H,76,92)(H,77,91)(H,78,89)(H,79,96)(H,80,94)(H,81,93)(H,82,95)(H3,70,71,72)/t43-,45-,46-,47-,48-,49-,50-,51-,52-/m0/s1
Reactome pathway
n/an/an/an/a 0.0650n/an/an/an/a
Takeda Pharmaceutical Company Ltd
Curated by ChEMBL
Assay Description
Agonist activity at human OT7T175 assessed as increase in intracellular calcium level by FLIPR assay
Bioorg Med Chem Lett 22: 6328-32 (2012)
Article DOI: 10.1016/j.bmcl.2012.08.087
BindingDB Entry DOI: 10.7270/Q22F7PJT