BDBM50392579 CHEMBL2152830
SMILES: CCCCCn1cc(C(=O)NCc2ccc(Cl)c(Cl)c2)c(=O)c2ccc(Sc3ccccc3)cc12
InChI Key: InChIKey=MDUHZJCHFSUEGU-UHFFFAOYSA-N
Data: 2 KI  1 EC50
Activity Spreadsheet -- Enzyme Inhibition Constant Data from BindingDB
Found 3 hits for monomerid = 50392579
Trg + Lig
Ki
nM
ΔG°
kcal/mole
IC50
nM
Kd
nM
EC50/IC50
nM
koff
s-1
kon
M-1s-1
pHTemp
°C
Cannabinoid receptor 1
(Homo sapiens (Human))
BDBM50392579
(CHEMBL2152830)
Show SMILES CCCCCn1cc(C(=O)NCc2ccc(Cl)c(Cl)c2)c(=O)c2ccc(Sc3ccccc3)cc12
Show InChI InChI=1S/C28H26Cl2N2O2S/c1-2-3-7-14-32-18-23(28(34)31-17-19-10-13-24(29)25(30)15-19)27(33)22-12-11-21(16-26(22)32)35-20-8-5-4-6-9-20/h4-6,8-13,15-16,18H,2-3,7,14,17H2,1H3,(H,31,34)
NCI pathway
Reactome pathway
420n/an/an/an/an/an/an/an/a
Universit£ degli Studi di Siena
Curated by ChEMBL
Assay Description
Displacement of [3H]CP55940 from human recombinant CB1 receptor transfected in HEK cell membrane
Eur J Med Chem 58: 30-43 (2012)
Article DOI: 10.1016/j.ejmech.2012.09.035
BindingDB Entry DOI: 10.7270/Q2JD4XW2
Cannabinoid receptor 2
(Homo sapiens (Human))
BDBM50392579
(CHEMBL2152830)
Show SMILES CCCCCn1cc(C(=O)NCc2ccc(Cl)c(Cl)c2)c(=O)c2ccc(Sc3ccccc3)cc12
Show InChI InChI=1S/C28H26Cl2N2O2S/c1-2-3-7-14-32-18-23(28(34)31-17-19-10-13-24(29)25(30)15-19)27(33)22-12-11-21(16-26(22)32)35-20-8-5-4-6-9-20/h4-6,8-13,15-16,18H,2-3,7,14,17H2,1H3,(H,31,34)
Reactome pathway
>1.00E+4n/an/an/an/an/an/an/an/a
Universit£ degli Studi di Siena
Curated by ChEMBL
Assay Description
Displacement of [3H]CP55940 from human recombinant CB2 receptor transfected in HEK cell membranes
Eur J Med Chem 58: 30-43 (2012)
Article DOI: 10.1016/j.ejmech.2012.09.035
BindingDB Entry DOI: 10.7270/Q2JD4XW2
Cannabinoid receptor 1
(Homo sapiens (Human))
BDBM50392579
(CHEMBL2152830)
Show SMILES CCCCCn1cc(C(=O)NCc2ccc(Cl)c(Cl)c2)c(=O)c2ccc(Sc3ccccc3)cc12
Show InChI InChI=1S/C28H26Cl2N2O2S/c1-2-3-7-14-32-18-23(28(34)31-17-19-10-13-24(29)25(30)15-19)27(33)22-12-11-21(16-26(22)32)35-20-8-5-4-6-9-20/h4-6,8-13,15-16,18H,2-3,7,14,17H2,1H3,(H,31,34)
NCI pathway
Reactome pathway
n/an/an/an/a 791n/an/an/an/a
Universit£ degli Studi di Siena
Curated by ChEMBL
Assay Description
Agonist activity at human CB1 receptor transfected in CHO cell membranes by [35S]GTPgammaS binding assay
Eur J Med Chem 58: 30-43 (2012)
Article DOI: 10.1016/j.ejmech.2012.09.035
BindingDB Entry DOI: 10.7270/Q2JD4XW2