null
SMILES: O=c1cc2n(nc(nc2cc1N1CCN(CC1)c1ccccc1)-c1ccccc1)-c1ccccc1
InChI Key: InChIKey=DRLIUXPFNZYGQX-UHFFFAOYSA-N
Activity Spreadsheet -- Enzyme Inhibition Constant Data from BindingDB
Found 1 hit for monomerid = 50392582
Trg + Lig
Ki
nM
ΔG°
kcal/mole
IC50
nM
Kd
nM
EC50/IC50
nM
koff
s-1
kon
M-1s-1
pHTemp
°C
Acetylcholinesterase
(Electrophorus electricus (Electric eel))
BDBM50392582
(CHEMBL2153014)
Show SMILES O=c1cc2n(nc(nc2cc1N1CCN(CC1)c1ccccc1)-c1ccccc1)-c1ccccc1
Show InChI InChI=1S/C29H25N5O/c35-28-21-26-25(20-27(28)33-18-16-32(17-19-33)23-12-6-2-7-13-23)30-29(22-10-4-1-5-11-22)31-34(26)24-14-8-3-9-15-24/h1-15,20-21H,16-19H2
n/an/a 2.20E+3n/an/an/an/an/an/a
Universit£ degli Studi di Bari Aldo Moro
Curated by ChEMBL
Assay Description
Inhibition of electric eel AChE using acetylthiocholine iodide as substrate after 20 mins by Ellman's method
Eur J Med Chem 58: 84-97 (2012)
Article DOI: 10.1016/j.ejmech.2012.10.003
BindingDB Entry DOI: 10.7270/Q2DR2WMH