BDBM50392590 CHEMBL2153378
SMILES: CC(C)N=CC(=O)N=S(C)(=O)c1ccc(cc1)C(=O)Nc1ccc(Cl)cc1C(=O)Nc1ccc(Cl)cn1
InChI Key: InChIKey=XKSVAHHHIIESOQ-UHFFFAOYSA-N
Data: 1 IC50
Activity Spreadsheet -- Enzyme Inhibition Constant Data from BindingDB
Found 1 hit for monomerid = 50392590
Trg + Lig
Ki
nM
ΔG°
kcal/mole
IC50
nM
Kd
nM
EC50/IC50
nM
koff
s-1
kon
M-1s-1
pHTemp
°C
Coagulation factor X
(Homo sapiens (Human))
BDBM50392590
(CHEMBL2153378)
Show SMILES CC(C)N=CC(=O)N=S(C)(=O)c1ccc(cc1)C(=O)Nc1ccc(Cl)cc1C(=O)Nc1ccc(Cl)cn1 |w:4.4|
Show InChI InChI=1S/C25H25Cl2N5O4S/c1-15(2)28-14-23(33)32-37(3,36)19-8-4-16(5-9-19)24(34)30-21-10-6-17(26)12-20(21)25(35)31-22-11-7-18(27)13-29-22/h4-15,37H,1-3H3,(H,30,34)(H,29,31,35)(H,32,33,36)
Reactome pathway
n/an/a 4n/an/an/an/an/an/a
Zydus Research Centre
Curated by ChEMBL
Assay Description
Inhibition of human F10a using S-2765 as substrate after 45 mins
Eur J Med Chem 58: 136-52 (2012)
Article DOI: 10.1016/j.ejmech.2012.10.005
BindingDB Entry DOI: 10.7270/Q2571D4Q