BDBM50392659 CHEMBL2153708
SMILES: Nc1nc(N)c2NC(CNc3ccc(cc3)C(=O)N[C@@H](CCC(O)=O)C(O)=O)CCc2n1
InChI Key: InChIKey=NJZPEYYRVZHUEO-PYMCNQPYSA-N
Data: 1 IC50
Activity Spreadsheet -- Enzyme Inhibition Constant Data from BindingDB
Found 1 hit for monomerid = 50392659
Trg + Lig
Ki
nM
ΔG°
kcal/mole
IC50
nM
Kd
nM
EC50/IC50
nM
koff
s-1
kon
M-1s-1
pHTemp
°C
Methionine synthase
(Homo sapiens (Human))
BDBM50392659
(CHEMBL2153708)
Show SMILES Nc1nc(N)c2NC(CNc3ccc(cc3)C(=O)N[C@@H](CCC(O)=O)C(O)=O)CCc2n1 |r|
Show InChI InChI=1S/C20H25N7O5/c21-17-16-13(26-20(22)27-17)6-5-12(24-16)9-23-11-3-1-10(2-4-11)18(30)25-14(19(31)32)7-8-15(28)29/h1-4,12,14,23-24H,5-9H2,(H,25,30)(H,28,29)(H,31,32)(H4,21,22,26,27)/t12?,14-/m0/s1
Reactome pathway
n/an/a 8.79E+4n/an/an/an/an/an/a
Peking University
Curated by ChEMBL
Assay Description
Inhibition of methionine synthase in human HL60 cells using L-homocysteine as substrate incubated for 3 hrs prior to substrate addition measured afte...
Eur J Med Chem 58: 228-36 (2012)
Article DOI: 10.1016/j.ejmech.2012.09.027
BindingDB Entry DOI: 10.7270/Q2RX9D5C