BDBM50392837 CHEMBL2151182
SMILES: CC#Cc1cncc(c1)-c1cc(c(Cl)s1)[C@]1(C)CC(=O)N(C)C(N)=N1
InChI Key: InChIKey=BIJGCEOIVVAQBS-SFHVURJKSA-N
Data: 1 KI  1 IC50
Activity Spreadsheet -- Enzyme Inhibition Constant Data from BindingDB
Found 2 hits for monomerid = 50392837
Trg + Lig
Ki
nM
ΔG°
kcal/mole
IC50
nM
Kd
nM
EC50/IC50
nM
koff
s-1
kon
M-1s-1
pHTemp
°C
Beta-secretase 1
(Homo sapiens (Human))
BDBM50392837
(CHEMBL2151182)
Show SMILES CC#Cc1cncc(c1)-c1cc(c(Cl)s1)[C@]1(C)CC(=O)N(C)C(N)=N1 |r,c:25|
Show InChI InChI=1S/C18H17ClN4OS/c1-4-5-11-6-12(10-21-9-11)14-7-13(16(19)25-14)18(2)8-15(24)23(3)17(20)22-18/h6-7,9-10H,8H2,1-3H3,(H2,20,22)/t18-/m0/s1
8n/an/an/an/an/an/an/an/a
TBA
Curated by ChEMBL
Assay Description
Inhibition of human recombinant BACE1 by FRET assay
ACS Med Chem Lett 3: 897-902 (2012)
Article DOI: 10.1021/ml3001165
BindingDB Entry DOI: 10.7270/Q23779SN
Beta-secretase 1
(Homo sapiens (Human))
BDBM50392837
(CHEMBL2151182)
Show SMILES CC#Cc1cncc(c1)-c1cc(c(Cl)s1)[C@]1(C)CC(=O)N(C)C(N)=N1 |r,c:25|
Show InChI InChI=1S/C18H17ClN4OS/c1-4-5-11-6-12(10-21-9-11)14-7-13(16(19)25-14)18(2)8-15(24)23(3)17(20)22-18/h6-7,9-10H,8H2,1-3H3,(H2,20,22)/t18-/m0/s1
n/an/a 67n/an/an/an/an/an/a
TBA
Curated by ChEMBL
Assay Description
Inhibition of BACE1 in HEK293 cells expressing APPswe/lon assessed as inhibition of amyloid beta-40 production
ACS Med Chem Lett 3: 897-902 (2012)
Article DOI: 10.1021/ml3001165
BindingDB Entry DOI: 10.7270/Q23779SN