BDBM50392843 CHEMBL1233206
SMILES: COc1cccc(c1)-c1cccc(c1)[C@]1(C)CC(=O)N(C)C(=N)N1
InChI Key: InChIKey=LQOCXPOKEPYGTJ-IBGZPJMESA-N
Data: 1 KI  1 IC50
Activity Spreadsheet -- Enzyme Inhibition Constant Data from BindingDB
Found 2 hits for monomerid = 50392843
Trg + Lig
Ki
nM
ΔG°
kcal/mole
IC50
nM
Kd
nM
EC50/IC50
nM
koff
s-1
kon
M-1s-1
pHTemp
°C
Beta-secretase 1
(Homo sapiens (Human))
BDBM50392843
(CHEMBL1233206)
Show SMILES COc1cccc(c1)-c1cccc(c1)[C@]1(C)CC(=O)N(C)C(=N)N1 |r|
Show InChI InChI=1S/C19H21N3O2/c1-19(12-17(23)22(2)18(20)21-19)15-8-4-6-13(10-15)14-7-5-9-16(11-14)24-3/h4-11H,12H2,1-3H3,(H2,20,21)/t19-/m0/s1
270n/an/an/an/an/an/an/an/a
TBA
Curated by ChEMBL
Assay Description
Inhibition of human recombinant BACE1 by FRET assay
ACS Med Chem Lett 3: 897-902 (2012)
Article DOI: 10.1021/ml3001165
BindingDB Entry DOI: 10.7270/Q23779SN
Beta-secretase 1
(Homo sapiens (Human))
BDBM50392843
(CHEMBL1233206)
Show SMILES COc1cccc(c1)-c1cccc(c1)[C@]1(C)CC(=O)N(C)C(=N)N1 |r|
Show InChI InChI=1S/C19H21N3O2/c1-19(12-17(23)22(2)18(20)21-19)15-8-4-6-13(10-15)14-7-5-9-16(11-14)24-3/h4-11H,12H2,1-3H3,(H2,20,21)/t19-/m0/s1
n/an/a 840n/an/an/an/an/an/a
TBA
Curated by ChEMBL
Assay Description
Inhibition of BACE1 in HEK293 cells expressing APPswe/lon assessed as inhibition of amyloid beta-40 production
ACS Med Chem Lett 3: 897-902 (2012)
Article DOI: 10.1021/ml3001165
BindingDB Entry DOI: 10.7270/Q23779SN