BDBM50393044 CHEMBL2152733
SMILES: Cc1cc(C)c2[nH]c(=O)n(O)c2c1
InChI Key: InChIKey=VEOOGZZBQWNLSL-UHFFFAOYSA-N
Data: 2 IC50
Activity Spreadsheet -- Enzyme Inhibition Constant Data from BindingDB
Found 2 hits for monomerid = 50393044
Trg + Lig
Ki
nM
ΔG°
kcal/mole
IC50
nM
Kd
nM
EC50/IC50
nM
koff
s-1
kon
M-1s-1
pHTemp
°C
D-amino-acid oxidase
(Sus scrofa (pig))
BDBM50393044
(CHEMBL2152733)
Show SMILES Cc1cc(C)c2[nH]c(=O)n(O)c2c1
Show InChI InChI=1S/C9H10N2O2/c1-5-3-6(2)8-7(4-5)11(13)9(12)10-8/h3-4,13H,1-2H3,(H,10,12)
Reactome pathway
n/an/a 4.00E+3n/an/an/an/an/an/a
TBA
Curated by ChEMBL
Assay Description
Inhibition of pig DAAO using D-serine as substrate after 20 mins by horseradish peroxidase-coupled assay
ACS Med Chem Lett 3: 839-843 (2012)
Article DOI: 10.1021/ml300212a
BindingDB Entry DOI: 10.7270/Q2WM1FGX
D-amino-acid oxidase
(Homo sapiens (Human))
BDBM50393044
(CHEMBL2152733)
Show SMILES Cc1cc(C)c2[nH]c(=O)n(O)c2c1
Show InChI InChI=1S/C9H10N2O2/c1-5-3-6(2)8-7(4-5)11(13)9(12)10-8/h3-4,13H,1-2H3,(H,10,12)
Reactome pathway
n/an/a 2.00E+4n/an/an/an/an/an/a
TBA
Curated by ChEMBL
Assay Description
Inhibition of human recombinant DAAO expressed in HEK293 cells using D-serine as substrate after 20 mins by horseradish peroxidase-coupled assay
ACS Med Chem Lett 3: 839-843 (2012)
Article DOI: 10.1021/ml300212a
BindingDB Entry DOI: 10.7270/Q2WM1FGX