BDBM50393059 CHEMBL2152720
SMILES: On1c2ccccc2[nH]c1=O
InChI Key: InChIKey=RNPPCNASSDPHSJ-UHFFFAOYSA-N
Data: 2 IC50
Activity Spreadsheet -- Enzyme Inhibition Constant Data from BindingDB
Found 2 hits for monomerid = 50393059
Trg + Lig
Ki
nM
ΔG°
kcal/mole
IC50
nM
Kd
nM
EC50/IC50
nM
koff
s-1
kon
M-1s-1
pHTemp
°C
D-amino-acid oxidase
(Homo sapiens (Human))
BDBM50393059
(CHEMBL2152720)
Show SMILES On1c2ccccc2[nH]c1=O
Show InChI InChI=1S/C7H6N2O2/c10-7-8-5-3-1-2-4-6(5)9(7)11/h1-4,11H,(H,8,10)
Reactome pathway
n/an/a 600n/an/an/an/an/an/a
TBA
Curated by ChEMBL
Assay Description
Inhibition of human recombinant DAAO expressed in HEK293 cells using D-serine as substrate after 20 mins by horseradish peroxidase-coupled assay
ACS Med Chem Lett 3: 839-843 (2012)
Article DOI: 10.1021/ml300212a
BindingDB Entry DOI: 10.7270/Q2WM1FGX
D-amino-acid oxidase
(Sus scrofa (pig))
BDBM50393059
(CHEMBL2152720)
Show SMILES On1c2ccccc2[nH]c1=O
Show InChI InChI=1S/C7H6N2O2/c10-7-8-5-3-1-2-4-6(5)9(7)11/h1-4,11H,(H,8,10)
Reactome pathway
n/an/a 1.00E+3n/an/an/an/an/an/a
TBA
Curated by ChEMBL
Assay Description
Inhibition of pig DAAO using D-serine as substrate after 20 mins by horseradish peroxidase-coupled assay
ACS Med Chem Lett 3: 839-843 (2012)
Article DOI: 10.1021/ml300212a
BindingDB Entry DOI: 10.7270/Q2WM1FGX