BDBM50393120 CHEMBL2153443
SMILES: Fc1cc(ccc1CNC(=O)CCCc1ccc2cccnc2n1)-c1cccc(c1)C(F)(F)F
InChI Key: InChIKey=ZFJGKUDKKAAZEM-UHFFFAOYSA-N
Data: 1 IC50
Activity Spreadsheet -- Enzyme Inhibition Constant Data from BindingDB
Found 1 hit for monomerid = 50393120
Trg + Lig
Ki
nM
ΔG°
kcal/mole
IC50
nM
Kd
nM
EC50/IC50
nM
koff
s-1
kon
M-1s-1
pHTemp
°C
Succinate receptor 1
(Homo sapiens (Human))
BDBM50393120
(CHEMBL2153443)
Show SMILES Fc1cc(ccc1CNC(=O)CCCc1ccc2cccnc2n1)-c1cccc(c1)C(F)(F)F
Show InChI InChI=1S/C26H21F4N3O/c27-23-15-19(18-4-1-6-21(14-18)26(28,29)30)9-10-20(23)16-32-24(34)8-2-7-22-12-11-17-5-3-13-31-25(17)33-22/h1,3-6,9-15H,2,7-8,16H2,(H,32,34)
Reactome pathway
n/an/a 41n/an/an/an/an/an/a
Advinus Therapeutics
Curated by ChEMBL
Assay Description
Antagonist activity at human GPR91 receptor expressed in CHO-K1 cells co-expressing Galpha and Gqi5 G-protein assessed as inhibition of succinate-ind...
Bioorg Med Chem Lett 21: 3596-602 (2011)
Article DOI: 10.1016/j.bmcl.2011.04.091
BindingDB Entry DOI: 10.7270/Q2BK1DG6