BDBM50393121 CHEMBL2153444
SMILES: CCc1cccc(c1)-c1ccc(CNC(=O)CCCc2ccc3cccnc3n2)cc1
InChI Key: InChIKey=FKUWIZCOCSEJIY-UHFFFAOYSA-N
Data: 1 IC50
Activity Spreadsheet -- Enzyme Inhibition Constant Data from BindingDB
Found 1 hit for monomerid = 50393121
Trg + Lig
Ki
nM
ΔG°
kcal/mole
IC50
nM
Kd
nM
EC50/IC50
nM
koff
s-1
kon
M-1s-1
pHTemp
°C
Succinate receptor 1
(Homo sapiens (Human))
BDBM50393121
(CHEMBL2153444)
Show SMILES CCc1cccc(c1)-c1ccc(CNC(=O)CCCc2ccc3cccnc3n2)cc1
Show InChI InChI=1S/C27H27N3O/c1-2-20-6-3-7-24(18-20)22-13-11-21(12-14-22)19-29-26(31)10-4-9-25-16-15-23-8-5-17-28-27(23)30-25/h3,5-8,11-18H,2,4,9-10,19H2,1H3,(H,29,31)
Reactome pathway
n/an/a 65n/an/an/an/an/an/a
Advinus Therapeutics
Curated by ChEMBL
Assay Description
Antagonist activity at human GPR91 receptor expressed in CHO-K1 cells co-expressing Galpha and Gqi5 G-protein assessed as inhibition of succinate-ind...
Bioorg Med Chem Lett 21: 3596-602 (2011)
Article DOI: 10.1016/j.bmcl.2011.04.091
BindingDB Entry DOI: 10.7270/Q2BK1DG6