BDBM50393163 CHEMBL2153438
SMILES: O=C(CCCc1ccc2cccnc2n1)NCc1ccc(cc1)-c1ccccc1
InChI Key: InChIKey=SFBYFQOWKAMMMK-UHFFFAOYSA-N
Data: 1 IC50
Activity Spreadsheet -- Enzyme Inhibition Constant Data from BindingDB
Found 1 hit for monomerid = 50393163
Trg + Lig
Ki
nM
ΔG°
kcal/mole
IC50
nM
Kd
nM
EC50/IC50
nM
koff
s-1
kon
M-1s-1
pHTemp
°C
Succinate receptor 1
(Homo sapiens (Human))
BDBM50393163
(CHEMBL2153438)
Show SMILES O=C(CCCc1ccc2cccnc2n1)NCc1ccc(cc1)-c1ccccc1
Show InChI InChI=1S/C25H23N3O/c29-24(10-4-9-23-16-15-22-8-5-17-26-25(22)28-23)27-18-19-11-13-21(14-12-19)20-6-2-1-3-7-20/h1-3,5-8,11-17H,4,9-10,18H2,(H,27,29)
Reactome pathway
n/an/a 1.00E+3n/an/an/an/an/an/a
Advinus Therapeutics
Curated by ChEMBL
Assay Description
Antagonist activity at human GPR91 receptor expressed in CHO-K1 cells co-expressing Galpha and Gqi5 G-protein assessed as inhibition of succinate-ind...
Bioorg Med Chem Lett 21: 3596-602 (2011)
Article DOI: 10.1016/j.bmcl.2011.04.091
BindingDB Entry DOI: 10.7270/Q2BK1DG6