BDBM50393301 CHEMBL2141722
SMILES: CC(C)(C)CCNc1nc(nnc1-c1ccccc1)-c1ccccn1
InChI Key: InChIKey=VZQQBRATUAQGEU-UHFFFAOYSA-N
Data: 3 EC50
Activity Spreadsheet -- Enzyme Inhibition Constant Data from BindingDB
Found 3 hits for monomerid = 50393301
Trg + Lig
Ki
nM
ΔG°
kcal/mole
IC50
nM
Kd
nM
EC50/IC50
nM
koff
s-1
kon
M-1s-1
pHTemp
°C
Hypoxia-inducible factor 1-alpha
(Homo sapiens (Human))
BDBM50393301
(CHEMBL2141722)
Show SMILES CC(C)(C)CCNc1nc(nnc1-c1ccccc1)-c1ccccn1
Show InChI InChI=1S/C20H23N5/c1-20(2,3)12-14-22-19-17(15-9-5-4-6-10-15)24-25-18(23-19)16-11-7-8-13-21-16/h4-11,13H,12,14H2,1-3H3,(H,22,23,25)
Reactome pathway
n/an/an/an/a 3.82E+3n/an/an/an/a
The Broad Institute Probe Development Center
Curated by ChEMBL
Assay Description
Activation of GFP-tagged HIF1alpha expressed in human U2OS cells assessed as HIF1alpha nuclear translocation by high content imaging assay
Bioorg Med Chem Lett 22: 76-81 (2011)
Article DOI: 10.1016/j.bmcl.2011.11.077
BindingDB Entry DOI: 10.7270/Q2XD12SN
Hypoxia-inducible factor 1-alpha
(Homo sapiens (Human))
BDBM50393301
(CHEMBL2141722)
Show SMILES CC(C)(C)CCNc1nc(nnc1-c1ccccc1)-c1ccccn1
Show InChI InChI=1S/C20H23N5/c1-20(2,3)12-14-22-19-17(15-9-5-4-6-10-15)24-25-18(23-19)16-11-7-8-13-21-16/h4-11,13H,12,14H2,1-3H3,(H,22,23,25)
Reactome pathway
n/an/an/an/a 2.97E+3n/an/an/an/a
The Broad Institute Probe Development Center
Curated by ChEMBL
Assay Description
Activation of human HIF1alpha expressed in DFX-induced human U2OS cells incubated for 30 mins prior to DFX-induction measured after overnight incubat...
Bioorg Med Chem Lett 22: 76-81 (2011)
Article DOI: 10.1016/j.bmcl.2011.11.077
BindingDB Entry DOI: 10.7270/Q2XD12SN
Hypoxia-inducible factor 1-alpha
(Homo sapiens (Human))
BDBM50393301
(CHEMBL2141722)
Show SMILES CC(C)(C)CCNc1nc(nnc1-c1ccccc1)-c1ccccn1
Show InChI InChI=1S/C20H23N5/c1-20(2,3)12-14-22-19-17(15-9-5-4-6-10-15)24-25-18(23-19)16-11-7-8-13-21-16/h4-11,13H,12,14H2,1-3H3,(H,22,23,25)
Reactome pathway
n/an/an/an/a 2.48E+3n/an/an/an/a
The Broad Institute Probe Development Center
Curated by ChEMBL
Assay Description
Activation of human HIF1alpha expressed in human U2OS cells assessed as increase in VEGF expression by RT-PCR analysis
Bioorg Med Chem Lett 22: 76-81 (2011)
Article DOI: 10.1016/j.bmcl.2011.11.077
BindingDB Entry DOI: 10.7270/Q2XD12SN