BDBM50393515 CHEMBL2158061
SMILES: COc1ccc(cc1OC1CCCC1)[C@@H]1CN(C)C(=O)C1
InChI Key: InChIKey=CFODIQZSRVSRRB-ZDUSSCGKSA-N
Data: 1 IC50  1 EC50
Activity Spreadsheet -- Enzyme Inhibition Constant Data from BindingDB
Found 2 hits for monomerid = 50393515
Trg + Lig
Ki
nM
ΔG°
kcal/mole
IC50
nM
Kd
nM
EC50/IC50
nM
koff
s-1
kon
M-1s-1
pHTemp
°C
cAMP-specific 3',5'-cyclic phosphodiesterase 4A
(Homo sapiens (Human))
BDBM50393515
(CHEMBL2158061)
Show SMILES COc1ccc(cc1OC1CCCC1)[C@@H]1CN(C)C(=O)C1 |r|
Show InChI InChI=1S/C17H23NO3/c1-18-11-13(10-17(18)19)12-7-8-15(20-2)16(9-12)21-14-5-3-4-6-14/h7-9,13-14H,3-6,10-11H2,1-2H3/t13-/m0/s1
n/an/a 1.00E+3n/an/an/an/an/an/a
University of Glasgow
Curated by ChEMBL
Assay Description
Inhibition of full-length PDE4A4 using cAMP as substrate by two-step radiochemical assay
J Med Chem 54: 3331-47 (2011)
Article DOI: 10.1021/jm200070e
BindingDB Entry DOI: 10.7270/Q2CF9R75
cAMP-specific 3',5'-cyclic phosphodiesterase 4A
(Homo sapiens (Human))
BDBM50393515
(CHEMBL2158061)
Show SMILES COc1ccc(cc1OC1CCCC1)[C@@H]1CN(C)C(=O)C1 |r|
Show InChI InChI=1S/C17H23NO3/c1-18-11-13(10-17(18)19)12-7-8-15(20-2)16(9-12)21-14-5-3-4-6-14/h7-9,13-14H,3-6,10-11H2,1-2H3/t13-/m0/s1
n/an/an/an/a 500n/an/an/an/a
University of Glasgow
Curated by ChEMBL
Assay Description
Induction of SQSTM1-dependent intracellular redistribution of GFP-tagged PDE4A4 assessed as maximal accretion of enzyme into foci
J Med Chem 54: 3331-47 (2011)
Article DOI: 10.1021/jm200070e
BindingDB Entry DOI: 10.7270/Q2CF9R75