BDBM50393521 CHEMBL2158067
SMILES: CCOc1cc(ccc1OC)[C@@H]1CNC(=O)C1
InChI Key: InChIKey=VTARTKPFBJOKKS-JTQLQIEISA-N
Data: 1 IC50  1 EC50
Activity Spreadsheet -- Enzyme Inhibition Constant Data from BindingDB
Found 2 hits for monomerid = 50393521
Trg + Lig
Ki
nM
ΔG°
kcal/mole
IC50
nM
Kd
nM
EC50/IC50
nM
koff
s-1
kon
M-1s-1
pHTemp
°C
cAMP-specific 3',5'-cyclic phosphodiesterase 4A
(Homo sapiens (Human))
BDBM50393521
(CHEMBL2158067)
Show SMILES CCOc1cc(ccc1OC)[C@@H]1CNC(=O)C1 |r|
Show InChI InChI=1S/C13H17NO3/c1-3-17-12-6-9(4-5-11(12)16-2)10-7-13(15)14-8-10/h4-6,10H,3,7-8H2,1-2H3,(H,14,15)/t10-/m0/s1
n/an/a 6.50E+3n/an/an/an/an/an/a
University of Glasgow
Curated by ChEMBL
Assay Description
Inhibition of full-length PDE4A4 using cAMP as substrate by two-step radiochemical assay
J Med Chem 54: 3331-47 (2011)
Article DOI: 10.1021/jm200070e
BindingDB Entry DOI: 10.7270/Q2CF9R75
cAMP-specific 3',5'-cyclic phosphodiesterase 4A
(Homo sapiens (Human))
BDBM50393521
(CHEMBL2158067)
Show SMILES CCOc1cc(ccc1OC)[C@@H]1CNC(=O)C1 |r|
Show InChI InChI=1S/C13H17NO3/c1-3-17-12-6-9(4-5-11(12)16-2)10-7-13(15)14-8-10/h4-6,10H,3,7-8H2,1-2H3,(H,14,15)/t10-/m0/s1
n/an/an/an/a 5.60E+3n/an/an/an/a
University of Glasgow
Curated by ChEMBL
Assay Description
Induction of SQSTM1-dependent intracellular redistribution of GFP-tagged PDE4A4 assessed as maximal accretion of enzyme into foci
J Med Chem 54: 3331-47 (2011)
Article DOI: 10.1021/jm200070e
BindingDB Entry DOI: 10.7270/Q2CF9R75