BDBM50393608 CHEMBL2158587
SMILES: COc1cc(ccc1Nc1ncc2ccc(-c3ccccc3OC)n2n1)C1CCN(CC1)C(=O)C1CCN1
InChI Key: InChIKey=MNUHUBSGVGOPGM-UHFFFAOYSA-N
Data: 3 IC50
Activity Spreadsheet -- Enzyme Inhibition Constant Data from BindingDB
Found 3 hits for monomerid = 50393608
Trg + Lig
Ki
nM
ΔG°
kcal/mole
IC50
nM
Kd
nM
EC50/IC50
nM
koff
s-1
kon
M-1s-1
pHTemp
°C
ALK tyrosine kinase receptor
(Homo sapiens (Human))
BDBM50393608
(CHEMBL2158587)
Show SMILES COc1cc(ccc1Nc1ncc2ccc(-c3ccccc3OC)n2n1)C1CCN(CC1)C(=O)C1CCN1
Show InChI InChI=1S/C29H32N6O3/c1-37-26-6-4-3-5-22(26)25-10-8-21-18-31-29(33-35(21)25)32-23-9-7-20(17-27(23)38-2)19-12-15-34(16-13-19)28(36)24-11-14-30-24/h3-10,17-19,24,30H,11-16H2,1-2H3,(H,32,33)
n/an/a 11n/an/an/an/an/an/a
Cephalon, Inc.
Curated by ChEMBL
Assay Description
Inhibition of GST-tagged human ALK cytoplasmic domain (1058-1620) expressed in Sf21 insect cells using GST-tagged human recombinant PLC-gamma/substra...
J Med Chem 55: 115-25 (2012)
Article DOI: 10.1021/jm2010767
BindingDB Entry DOI: 10.7270/Q2G73FV3
ALK tyrosine kinase receptor/Nucleophosmin
(Homo sapiens (Human))
BDBM50393608
(CHEMBL2158587)
Show SMILES COc1cc(ccc1Nc1ncc2ccc(-c3ccccc3OC)n2n1)C1CCN(CC1)C(=O)C1CCN1
Show InChI InChI=1S/C29H32N6O3/c1-37-26-6-4-3-5-22(26)25-10-8-21-18-31-29(33-35(21)25)32-23-9-7-20(17-27(23)38-2)19-12-15-34(16-13-19)28(36)24-11-14-30-24/h3-10,17-19,24,30H,11-16H2,1-2H3,(H,32,33)
n/an/a 200n/an/an/an/an/an/a
Cephalon, Inc.
Curated by ChEMBL
Assay Description
Inhibition of human NPM-ALK phosphorylation using 4-MeUP substrate by cell based assay
J Med Chem 55: 115-25 (2012)
Article DOI: 10.1021/jm2010767
BindingDB Entry DOI: 10.7270/Q2G73FV3
Insulin receptor
(Homo sapiens (Human))
BDBM50393608
(CHEMBL2158587)
Show SMILES COc1cc(ccc1Nc1ncc2ccc(-c3ccccc3OC)n2n1)C1CCN(CC1)C(=O)C1CCN1
Show InChI InChI=1S/C29H32N6O3/c1-37-26-6-4-3-5-22(26)25-10-8-21-18-31-29(33-35(21)25)32-23-9-7-20(17-27(23)38-2)19-12-15-34(16-13-19)28(36)24-11-14-30-24/h3-10,17-19,24,30H,11-16H2,1-2H3,(H,32,33)
n/an/a 335n/an/an/an/an/an/a
Cephalon, Inc.
Curated by ChEMBL
Assay Description
Inhibition of IR
J Med Chem 55: 115-25 (2012)
Article DOI: 10.1021/jm2010767
BindingDB Entry DOI: 10.7270/Q2G73FV3