BDBM50393624 CHEMBL2158516
SMILES: COc1cc(ccc1Nc1ncc2ccc(-c3ccccc3N(C)S(C)(=O)=O)n2n1)C1CCN(CC(N)=O)CC1
InChI Key: InChIKey=HATRKFPXWDUKPL-UHFFFAOYSA-N
Data: 3 IC50
Activity Spreadsheet -- Enzyme Inhibition Constant Data from BindingDB
Found 3 hits for monomerid = 50393624
Trg + Lig
Ki
nM
ΔG°
kcal/mole
IC50
nM
Kd
nM
EC50/IC50
nM
koff
s-1
kon
M-1s-1
pHTemp
°C
Insulin receptor
(Homo sapiens (Human))
BDBM50393624
(CHEMBL2158516)
Show SMILES COc1cc(ccc1Nc1ncc2ccc(-c3ccccc3N(C)S(C)(=O)=O)n2n1)C1CCN(CC(N)=O)CC1
Show InChI InChI=1S/C28H33N7O4S/c1-33(40(3,37)38)24-7-5-4-6-22(24)25-11-9-21-17-30-28(32-35(21)25)31-23-10-8-20(16-26(23)39-2)19-12-14-34(15-13-19)18-27(29)36/h4-11,16-17,19H,12-15,18H2,1-3H3,(H2,29,36)(H,31,32)
n/an/a 552n/an/an/an/an/an/a
Cephalon, Inc.
Curated by ChEMBL
Assay Description
Inhibition of IR
J Med Chem 55: 115-25 (2012)
Article DOI: 10.1021/jm2010767
BindingDB Entry DOI: 10.7270/Q2G73FV3
ALK tyrosine kinase receptor
(Homo sapiens (Human))
BDBM50393624
(CHEMBL2158516)
Show SMILES COc1cc(ccc1Nc1ncc2ccc(-c3ccccc3N(C)S(C)(=O)=O)n2n1)C1CCN(CC(N)=O)CC1
Show InChI InChI=1S/C28H33N7O4S/c1-33(40(3,37)38)24-7-5-4-6-22(24)25-11-9-21-17-30-28(32-35(21)25)31-23-10-8-20(16-26(23)39-2)19-12-14-34(15-13-19)18-27(29)36/h4-11,16-17,19H,12-15,18H2,1-3H3,(H2,29,36)(H,31,32)
n/an/a 15n/an/an/an/an/an/a
Cephalon, Inc.
Curated by ChEMBL
Assay Description
Inhibition of GST-tagged human ALK cytoplasmic domain (1058-1620) expressed in Sf21 insect cells using GST-tagged human recombinant PLC-gamma/substra...
J Med Chem 55: 115-25 (2012)
Article DOI: 10.1021/jm2010767
BindingDB Entry DOI: 10.7270/Q2G73FV3
ALK tyrosine kinase receptor/Nucleophosmin
(Homo sapiens (Human))
BDBM50393624
(CHEMBL2158516)
Show SMILES COc1cc(ccc1Nc1ncc2ccc(-c3ccccc3N(C)S(C)(=O)=O)n2n1)C1CCN(CC(N)=O)CC1
Show InChI InChI=1S/C28H33N7O4S/c1-33(40(3,37)38)24-7-5-4-6-22(24)25-11-9-21-17-30-28(32-35(21)25)31-23-10-8-20(16-26(23)39-2)19-12-14-34(15-13-19)18-27(29)36/h4-11,16-17,19H,12-15,18H2,1-3H3,(H2,29,36)(H,31,32)
n/an/a 80n/an/an/an/an/an/a
Cephalon, Inc.
Curated by ChEMBL
Assay Description
Inhibition of human NPM-ALK phosphorylation using 4-MeUP substrate by cell based assay
J Med Chem 55: 115-25 (2012)
Article DOI: 10.1021/jm2010767
BindingDB Entry DOI: 10.7270/Q2G73FV3