BDBM50393782 CHEMBL2159338
SMILES: C[C@H](c1ccc(cc1)C(=O)NCCC(O)=O)n1nc(cc1-c1ccc2cc(OC(F)(F)F)ccc2c1)-c1cc(Cl)cc(Cl)c1
InChI Key: InChIKey=QLCNDVIJFAHAFO-GOSISDBHSA-N
Data: 3 IC50
Activity Spreadsheet -- Enzyme Inhibition Constant Data from BindingDB
Found 3 hits for monomerid = 50393782
Trg + Lig
Ki
nM
ΔG°
kcal/mole
IC50
nM
Kd
nM
EC50/IC50
nM
koff
s-1
kon
M-1s-1
pHTemp
°C
Glucagon receptor
(Homo sapiens (Human))
BDBM50393782
(CHEMBL2159338)
Show SMILES C[C@H](c1ccc(cc1)C(=O)NCCC(O)=O)n1nc(cc1-c1ccc2cc(OC(F)(F)F)ccc2c1)-c1cc(Cl)cc(Cl)c1 |r|
Show InChI InChI=1S/C32H24Cl2F3N3O4/c1-18(19-2-4-20(5-3-19)31(43)38-11-10-30(41)42)40-29(17-28(39-40)24-13-25(33)16-26(34)14-24)23-7-6-22-15-27(44-32(35,36)37)9-8-21(22)12-23/h2-9,12-18H,10-11H2,1H3,(H,38,43)(H,41,42)/t18-/m1/s1
n/an/a 17n/an/an/an/an/an/a
Merck Research Laboratories
Curated by ChEMBL
Assay Description
Displacement of [125I]glucagon from human GCGR expressed in CHO cells after 3 hrs by scintillation proximity assay
J Med Chem 55: 6137-48 (2012)
Article DOI: 10.1021/jm300579z
BindingDB Entry DOI: 10.7270/Q2X63P2C
Glucagon receptor
(Homo sapiens (Human))
BDBM50393782
(CHEMBL2159338)
Show SMILES C[C@H](c1ccc(cc1)C(=O)NCCC(O)=O)n1nc(cc1-c1ccc2cc(OC(F)(F)F)ccc2c1)-c1cc(Cl)cc(Cl)c1 |r|
Show InChI InChI=1S/C32H24Cl2F3N3O4/c1-18(19-2-4-20(5-3-19)31(43)38-11-10-30(41)42)40-29(17-28(39-40)24-13-25(33)16-26(34)14-24)23-7-6-22-15-27(44-32(35,36)37)9-8-21(22)12-23/h2-9,12-18H,10-11H2,1H3,(H,38,43)(H,41,42)/t18-/m1/s1
n/an/a 33n/an/an/an/an/an/a
Merck Research Laboratories
Curated by ChEMBL
Assay Description
Antagonist activity at human GCGR expressed in CHO cells assessed as inhibition of glucagon-induced cAMP accumulation preincubated for 30 mins prior ...
J Med Chem 55: 6137-48 (2012)
Article DOI: 10.1021/jm300579z
BindingDB Entry DOI: 10.7270/Q2X63P2C
Gastric inhibitory polypeptide receptor
(Homo sapiens (Human))
BDBM50393782
(CHEMBL2159338)
Show SMILES C[C@H](c1ccc(cc1)C(=O)NCCC(O)=O)n1nc(cc1-c1ccc2cc(OC(F)(F)F)ccc2c1)-c1cc(Cl)cc(Cl)c1 |r|
Show InChI InChI=1S/C32H24Cl2F3N3O4/c1-18(19-2-4-20(5-3-19)31(43)38-11-10-30(41)42)40-29(17-28(39-40)24-13-25(33)16-26(34)14-24)23-7-6-22-15-27(44-32(35,36)37)9-8-21(22)12-23/h2-9,12-18H,10-11H2,1H3,(H,38,43)(H,41,42)/t18-/m1/s1
Reactome pathway
n/an/a 1.13E+3n/an/an/an/an/an/a
Merck Research Laboratories
Curated by ChEMBL
Assay Description
Antagonist activity at human GIPR expressed in CHO cells assessed as inhibition of glucagon-induced cAMP accumulation preincubated for 30 mins prior ...
J Med Chem 55: 6137-48 (2012)
Article DOI: 10.1021/jm300579z
BindingDB Entry DOI: 10.7270/Q2X63P2C