BDBM50393803 CHEMBL2159547
SMILES: [O-][N+](=O)c1ccc(cc1C(F)(F)F)C1=NOC2CCCCCCC12
InChI Key: InChIKey=MYRFEWWWKLHDFO-UHFFFAOYSA-N
Data: 1 IC50
Activity Spreadsheet -- Enzyme Inhibition Constant Data from BindingDB
Found 1 hit for monomerid = 50393803
Trg + Lig
Ki
nM
ΔG°
kcal/mole
IC50
nM
Kd
nM
EC50/IC50
nM
koff
s-1
kon
M-1s-1
pHTemp
°C
Androgen Receptor
(Homo sapiens (Human))
BDBM50393803
(CHEMBL2159547)
Show SMILES [O-][N+](=O)c1ccc(cc1C(F)(F)F)C1=NOC2CCCCCCC12 |t:14|
Show InChI InChI=1S/C16H17F3N2O3/c17-16(18,19)12-9-10(7-8-13(12)21(22)23)15-11-5-3-1-2-4-6-14(11)24-20-15/h7-9,11,14H,1-6H2
NCI pathway
Reactome pathway
n/an/a 708n/an/an/an/an/an/a
University of Eastern Finland
Curated by ChEMBL
Assay Description
Displacement of [3H]R1881 from wild type human androgen receptor expressed in COS-1 cells co-transfected with pSG5 after 15 mins by scintillation ass...
J Med Chem 55: 6316-27 (2012)
Article DOI: 10.1021/jm300233k
BindingDB Entry DOI: 10.7270/Q2NS0W1N