BDBM50393805 CHEMBL2159545
SMILES: FC(F)(F)c1cc(ccc1C#N)C1=NOC2CCCCCCC12
InChI Key: InChIKey=NKSCWPBTNSEPOZ-UHFFFAOYSA-N
Data: 1 IC50
Activity Spreadsheet -- Enzyme Inhibition Constant Data from BindingDB
Found 1 hit for monomerid = 50393805
Trg + Lig
Ki
nM
ΔG°
kcal/mole
IC50
nM
Kd
nM
EC50/IC50
nM
koff
s-1
kon
M-1s-1
pHTemp
°C
Androgen Receptor
(Homo sapiens (Human))
BDBM50393805
(CHEMBL2159545)
Show SMILES FC(F)(F)c1cc(ccc1C#N)C1=NOC2CCCCCCC12 |t:13|
Show InChI InChI=1S/C17H17F3N2O/c18-17(19,20)14-9-11(7-8-12(14)10-21)16-13-5-3-1-2-4-6-15(13)23-22-16/h7-9,13,15H,1-6H2
NCI pathway
Reactome pathway
n/an/a 295n/an/an/an/an/an/a
University of Eastern Finland
Curated by ChEMBL
Assay Description
Displacement of [3H]R1881 from wild type human androgen receptor expressed in COS-1 cells co-transfected with pSG5 after 15 mins by scintillation ass...
J Med Chem 55: 6316-27 (2012)
Article DOI: 10.1021/jm300233k
BindingDB Entry DOI: 10.7270/Q2NS0W1N