BDBM50393812 CHEMBL2159550
SMILES: Fc1ccc(C2=NOC3CCCCCCC23)c(c1)C(F)(F)F
InChI Key: InChIKey=LFKWVDHNWBUTDZ-UHFFFAOYSA-N
Data: 1 IC50
Activity Spreadsheet -- Enzyme Inhibition Constant Data from BindingDB
Found 1 hit for monomerid = 50393812
Trg + Lig
Ki
nM
ΔG°
kcal/mole
IC50
nM
Kd
nM
EC50/IC50
nM
koff
s-1
kon
M-1s-1
pHTemp
°C
Androgen Receptor
(Homo sapiens (Human))
BDBM50393812
(CHEMBL2159550)
Show SMILES Fc1ccc(C2=NOC3CCCCCCC23)c(c1)C(F)(F)F |t:5|
Show InChI InChI=1S/C16H17F4NO/c17-10-7-8-11(13(9-10)16(18,19)20)15-12-5-3-1-2-4-6-14(12)22-21-15/h7-9,12,14H,1-6H2
NCI pathway
Reactome pathway
n/an/a 1.32E+4n/an/an/an/an/an/a
University of Eastern Finland
Curated by ChEMBL
Assay Description
Displacement of [3H]R1881 from wild type human androgen receptor expressed in COS-1 cells co-transfected with pSG5 after 15 mins by scintillation ass...
J Med Chem 55: 6316-27 (2012)
Article DOI: 10.1021/jm300233k
BindingDB Entry DOI: 10.7270/Q2NS0W1N