BDBM50393814 CHEMBL2159573
SMILES: Fc1ccc(C2=NOC3CCCCC23)c(c1)C(F)(F)F
InChI Key: InChIKey=IRCHMBHSSBPTQR-UHFFFAOYSA-N
Data: 2 IC50
Activity Spreadsheet -- Enzyme Inhibition Constant Data from BindingDB
Found 2 hits for monomerid = 50393814
Trg + Lig
Ki
nM
ΔG°
kcal/mole
IC50
nM
Kd
nM
EC50/IC50
nM
koff
s-1
kon
M-1s-1
pHTemp
°C
Androgen Receptor
(Homo sapiens (Human))
BDBM50393814
(CHEMBL2159573)
Show SMILES Fc1ccc(C2=NOC3CCCCC23)c(c1)C(F)(F)F |t:5|
Show InChI InChI=1S/C14H13F4NO/c15-8-5-6-9(11(7-8)14(16,17)18)13-10-3-1-2-4-12(10)20-19-13/h5-7,10,12H,1-4H2
NCI pathway
Reactome pathway
n/an/a 1.15E+3n/an/an/an/an/an/a
University of Eastern Finland
Curated by ChEMBL
Assay Description
Displacement of [3H]R1881 from wild type human androgen receptor expressed in COS-1 cells co-transfected with pSG5 after 15 mins by scintillation ass...
J Med Chem 55: 6316-27 (2012)
Article DOI: 10.1021/jm300233k
BindingDB Entry DOI: 10.7270/Q2NS0W1N
Androgen Receptor
(Homo sapiens (Human))
BDBM50393814
(CHEMBL2159573)
Show SMILES Fc1ccc(C2=NOC3CCCCC23)c(c1)C(F)(F)F |t:5|
Show InChI InChI=1S/C14H13F4NO/c15-8-5-6-9(11(7-8)14(16,17)18)13-10-3-1-2-4-12(10)20-19-13/h5-7,10,12H,1-4H2
NCI pathway
Reactome pathway
n/an/a 977n/an/an/an/an/an/a
University of Eastern Finland
Curated by ChEMBL
Assay Description
Displacement of [3H]R1881 from wild type human androgen receptor expressed in COS-1 cells co-transfected with pSG5 after 15 mins by scintillation ass...
J Med Chem 55: 6316-27 (2012)
Article DOI: 10.1021/jm300233k
BindingDB Entry DOI: 10.7270/Q2NS0W1N