BDBM50393817 CHEMBL2159570
SMILES: [O-][N+](=O)c1ccc(C2=NO[C@@H]3CCCC[C@H]23)c(c1)C(F)(F)F
InChI Key: InChIKey=RIYAZEGHCJEQPR-CMPLNLGQSA-N
Data: 1 IC50
Activity Spreadsheet -- Enzyme Inhibition Constant Data from BindingDB
Found 1 hit for monomerid = 50393817
Trg + Lig
Ki
nM
ΔG°
kcal/mole
IC50
nM
Kd
nM
EC50/IC50
nM
koff
s-1
kon
M-1s-1
pHTemp
°C
Androgen Receptor
(Homo sapiens (Human))
BDBM50393817
(CHEMBL2159570)
Show SMILES [O-][N+](=O)c1ccc(C2=NO[C@@H]3CCCC[C@H]23)c(c1)C(F)(F)F |r,t:7|
Show InChI InChI=1S/C14H13F3N2O3/c15-14(16,17)11-7-8(19(20)21)5-6-9(11)13-10-3-1-2-4-12(10)22-18-13/h5-7,10,12H,1-4H2/t10-,12+/m0/s1
NCI pathway
Reactome pathway
n/an/a 129n/an/an/an/an/an/a
University of Eastern Finland
Curated by ChEMBL
Assay Description
Displacement of [3H]R1881 from wild type human androgen receptor expressed in COS-1 cells co-transfected with pSG5 after 15 mins by scintillation ass...
J Med Chem 55: 6316-27 (2012)
Article DOI: 10.1021/jm300233k
BindingDB Entry DOI: 10.7270/Q2NS0W1N