BDBM50393827 CHEMBL2159731
SMILES: FC(F)(F)c1cc(ccc1C1=NOC2CCCC12)C#N
InChI Key: InChIKey=UFDAVUOYTGQPPZ-UHFFFAOYSA-N
Data: 1 IC50
Activity Spreadsheet -- Enzyme Inhibition Constant Data from BindingDB
Found 1 hit for monomerid = 50393827
Trg + Lig
Ki
nM
ΔG°
kcal/mole
IC50
nM
Kd
nM
EC50/IC50
nM
koff
s-1
kon
M-1s-1
pHTemp
°C
Androgen Receptor
(Homo sapiens (Human))
BDBM50393827
(CHEMBL2159731)
Show SMILES FC(F)(F)c1cc(ccc1C1=NOC2CCCC12)C#N |t:11|
Show InChI InChI=1S/C14H11F3N2O/c15-14(16,17)11-6-8(7-18)4-5-9(11)13-10-2-1-3-12(10)20-19-13/h4-6,10,12H,1-3H2
NCI pathway
Reactome pathway
n/an/a 447n/an/an/an/an/an/a
University of Eastern Finland
Curated by ChEMBL
Assay Description
Displacement of [3H]R1881 from wild type human androgen receptor expressed in COS-1 cells co-transfected with pSG5 after 15 mins by scintillation ass...
J Med Chem 55: 6316-27 (2012)
Article DOI: 10.1021/jm300233k
BindingDB Entry DOI: 10.7270/Q2NS0W1N