BDBM50393836 CHEMBL2159738
SMILES: CN(C)CC[C@H](CSc1ccccc1)Nc1ccc(cc1[N+]([O-])=O)S(=O)(=O)Nc1ccc(cc1)N1CCN(CC1)c1cccc(c1)-c1cc(C)n(C)c1-c1ccc(Cl)cc1
InChI Key: InChIKey=IUURYJVPFGWYCA-KXQOOQHDSA-N
Data: 1 KI  4 IC50
Activity Spreadsheet -- Enzyme Inhibition Constant Data from BindingDB
Found 5 hits for monomerid = 50393836
Trg + Lig
Ki
nM
ΔG°
kcal/mole
IC50
nM
Kd
nM
EC50/IC50
nM
koff
s-1
kon
M-1s-1
pHTemp
°C
Bcl-2-like protein 1
(Homo sapiens (Human))
BDBM50393836
(CHEMBL2159738)
Show SMILES CN(C)CC[C@H](CSc1ccccc1)Nc1ccc(cc1[N+]([O-])=O)S(=O)(=O)Nc1ccc(cc1)N1CCN(CC1)c1cccc(c1)-c1cc(C)n(C)c1-c1ccc(Cl)cc1 |r|
Show InChI InChI=1S/C46H50ClN7O4S2/c1-33-29-43(46(51(33)4)34-13-15-36(47)16-14-34)35-9-8-10-40(30-35)53-27-25-52(26-28-53)39-19-17-37(18-20-39)49-60(57,58)42-21-22-44(45(31-42)54(55)56)48-38(23-24-50(2)3)32-59-41-11-6-5-7-12-41/h5-22,29-31,38,48-49H,23-28,32H2,1-4H3/t38-/m1/s1
NCI pathway
Reactome pathway
1.20n/an/an/an/an/an/an/an/a
University of Michigan
Curated by ChEMBL
Assay Description
Inhibition of human N-terminal His8-tagged Bcl-XL expressed in Escherichia coli BL21(DE3) assessed as inhibition of Fluorescein-labeled BAK binding a...
J Med Chem 55: 6149-61 (2012)
Article DOI: 10.1021/jm300608w
BindingDB Entry DOI: 10.7270/Q2J10485
Bcl-2-like protein 1
(Homo sapiens (Human))
BDBM50393836
(CHEMBL2159738)
Show SMILES CN(C)CC[C@H](CSc1ccccc1)Nc1ccc(cc1[N+]([O-])=O)S(=O)(=O)Nc1ccc(cc1)N1CCN(CC1)c1cccc(c1)-c1cc(C)n(C)c1-c1ccc(Cl)cc1 |r|
Show InChI InChI=1S/C46H50ClN7O4S2/c1-33-29-43(46(51(33)4)34-13-15-36(47)16-14-34)35-9-8-10-40(30-35)53-27-25-52(26-28-53)39-19-17-37(18-20-39)49-60(57,58)42-21-22-44(45(31-42)54(55)56)48-38(23-24-50(2)3)32-59-41-11-6-5-7-12-41/h5-22,29-31,38,48-49H,23-28,32H2,1-4H3/t38-/m1/s1
NCI pathway
Reactome pathway
n/an/a 11n/an/an/an/an/an/a
University of Michigan
Curated by ChEMBL
Assay Description
Inhibition of human N-terminal His8-tagged Bcl-XL expressed in Escherichia coli BL21(DE3) assessed as inhibition of Fluorescein-labeled BAK binding a...
J Med Chem 55: 6149-61 (2012)
Article DOI: 10.1021/jm300608w
BindingDB Entry DOI: 10.7270/Q2J10485
Apoptosis regulator Bcl-2
(Homo sapiens (Human))
BDBM50393836
(CHEMBL2159738)
Show SMILES CN(C)CC[C@H](CSc1ccccc1)Nc1ccc(cc1[N+]([O-])=O)S(=O)(=O)Nc1ccc(cc1)N1CCN(CC1)c1cccc(c1)-c1cc(C)n(C)c1-c1ccc(Cl)cc1 |r|
Show InChI InChI=1S/C46H50ClN7O4S2/c1-33-29-43(46(51(33)4)34-13-15-36(47)16-14-34)35-9-8-10-40(30-35)53-27-25-52(26-28-53)39-19-17-37(18-20-39)49-60(57,58)42-21-22-44(45(31-42)54(55)56)48-38(23-24-50(2)3)32-59-41-11-6-5-7-12-41/h5-22,29-31,38,48-49H,23-28,32H2,1-4H3/t38-/m1/s1
n/an/a 99n/an/an/an/an/an/a
University of Michigan
Curated by ChEMBL
Assay Description
Binding affinity to BCL2 (unknown origin) after 2 hrs by fluorescence polarization assay
J Med Chem 56: 3048-67 (2013)
Article DOI: 10.1021/jm4001105
BindingDB Entry DOI: 10.7270/Q2H41SSV
Bcl-2-like protein 1
(Homo sapiens (Human))
BDBM50393836
(CHEMBL2159738)
Show SMILES CN(C)CC[C@H](CSc1ccccc1)Nc1ccc(cc1[N+]([O-])=O)S(=O)(=O)Nc1ccc(cc1)N1CCN(CC1)c1cccc(c1)-c1cc(C)n(C)c1-c1ccc(Cl)cc1 |r|
Show InChI InChI=1S/C46H50ClN7O4S2/c1-33-29-43(46(51(33)4)34-13-15-36(47)16-14-34)35-9-8-10-40(30-35)53-27-25-52(26-28-53)39-19-17-37(18-20-39)49-60(57,58)42-21-22-44(45(31-42)54(55)56)48-38(23-24-50(2)3)32-59-41-11-6-5-7-12-41/h5-22,29-31,38,48-49H,23-28,32H2,1-4H3/t38-/m1/s1
NCI pathway
Reactome pathway
n/an/a 11n/an/an/an/an/an/a
University of Michigan
Curated by ChEMBL
Assay Description
Binding affinity to BCL-XL (unknown origin) after 2 hrs by fluorescence polarization assay
J Med Chem 56: 3048-67 (2013)
Article DOI: 10.1021/jm4001105
BindingDB Entry DOI: 10.7270/Q2H41SSV
Induced myeloid leukemia cell differentiation protein Mcl-1
(Homo sapiens (Human))
BDBM50393836
(CHEMBL2159738)
Show SMILES CN(C)CC[C@H](CSc1ccccc1)Nc1ccc(cc1[N+]([O-])=O)S(=O)(=O)Nc1ccc(cc1)N1CCN(CC1)c1cccc(c1)-c1cc(C)n(C)c1-c1ccc(Cl)cc1 |r|
Show InChI InChI=1S/C46H50ClN7O4S2/c1-33-29-43(46(51(33)4)34-13-15-36(47)16-14-34)35-9-8-10-40(30-35)53-27-25-52(26-28-53)39-19-17-37(18-20-39)49-60(57,58)42-21-22-44(45(31-42)54(55)56)48-38(23-24-50(2)3)32-59-41-11-6-5-7-12-41/h5-22,29-31,38,48-49H,23-28,32H2,1-4H3/t38-/m1/s1
NCI pathway
n/an/a>1.00E+4n/an/an/an/an/an/a
University of Michigan
Curated by ChEMBL
Assay Description
Inhibition of human N-terminal His8-tagged Mcl1 expressed in Escherichia coli BL21(DE3) assessed as inhibition of Fluorescein-labeled BID binding aft...
J Med Chem 55: 6149-61 (2012)
Article DOI: 10.1021/jm300608w
BindingDB Entry DOI: 10.7270/Q2J10485