BDBM50393857 CHEMBL2158123
SMILES: CCN(CCCNc1c2CCCCc2nc2ccccc12)CCC(=O)Nc1nc(cs1)-c1ccc(Cl)cc1
InChI Key: InChIKey=XFIYFWAYRZWUOS-UHFFFAOYSA-N
Data: 2 IC50
Activity Spreadsheet -- Enzyme Inhibition Constant Data from BindingDB
Found 2 hits for monomerid = 50393857
Trg + Lig
Ki
nM
ΔG°
kcal/mole
IC50
nM
Kd
nM
EC50/IC50
nM
koff
s-1
kon
M-1s-1
pHTemp
°C
Acetylcholinesterase
(Electrophorus electricus (Electric eel))
BDBM50393857
(CHEMBL2158123)
Show SMILES CCN(CCCNc1c2CCCCc2nc2ccccc12)CCC(=O)Nc1nc(cs1)-c1ccc(Cl)cc1
Show InChI InChI=1S/C30H34ClN5OS/c1-2-36(19-16-28(37)35-30-34-27(20-38-30)21-12-14-22(31)15-13-21)18-7-17-32-29-23-8-3-5-10-25(23)33-26-11-6-4-9-24(26)29/h3,5,8,10,12-15,20H,2,4,6-7,9,11,16-19H2,1H3,(H,32,33)(H,34,35,37)
n/an/a 1.20E+3n/an/an/an/an/an/a
Huazhong University of Science and Technology
Curated by ChEMBL
Assay Description
Inhibition of electric eel AChE using acetylthiocholine chloride substrate incubated for 5 mins before substrate addition measured at 3 min interval ...
Bioorg Med Chem 20: 6513-22 (2012)
Article DOI: 10.1016/j.bmc.2012.08.040
BindingDB Entry DOI: 10.7270/Q20Z74DZ
Butyrylcholinesterase (BuChE)
(Equus caballus (Horse))
BDBM50393857
(CHEMBL2158123)
Show SMILES CCN(CCCNc1c2CCCCc2nc2ccccc12)CCC(=O)Nc1nc(cs1)-c1ccc(Cl)cc1
Show InChI InChI=1S/C30H34ClN5OS/c1-2-36(19-16-28(37)35-30-34-27(20-38-30)21-12-14-22(31)15-13-21)18-7-17-32-29-23-8-3-5-10-25(23)33-26-11-6-4-9-24(26)29/h3,5,8,10,12-15,20H,2,4,6-7,9,11,16-19H2,1H3,(H,32,33)(H,34,35,37)
n/an/a 4.17n/an/an/an/an/an/a
Huazhong University of Science and Technology
Curated by ChEMBL
Assay Description
Inhibition of equine serum BuChE using butylthiocholine chloride substrate incubated for 5 mins before substrate addition measured at 3 min interval ...
Bioorg Med Chem 20: 6513-22 (2012)
Article DOI: 10.1016/j.bmc.2012.08.040
BindingDB Entry DOI: 10.7270/Q20Z74DZ