BDBM50393858 CHEMBL2158122
SMILES: CCN(CCCNc1c2CCCCc2nc2ccccc12)CCC(=O)Nc1nc(cs1)-c1ccc(OC)cc1
InChI Key: InChIKey=IUDDYFCOEGNNOK-UHFFFAOYSA-N
Data: 2 IC50
Activity Spreadsheet -- Enzyme Inhibition Constant Data from BindingDB
Found 2 hits for monomerid = 50393858
Trg + Lig
Ki
nM
ΔG°
kcal/mole
IC50
nM
Kd
nM
EC50/IC50
nM
koff
s-1
kon
M-1s-1
pHTemp
°C
Acetylcholinesterase
(Electrophorus electricus (Electric eel))
BDBM50393858
(CHEMBL2158122)
Show SMILES CCN(CCCNc1c2CCCCc2nc2ccccc12)CCC(=O)Nc1nc(cs1)-c1ccc(OC)cc1
Show InChI InChI=1S/C31H37N5O2S/c1-3-36(20-17-29(37)35-31-34-28(21-39-31)22-13-15-23(38-2)16-14-22)19-8-18-32-30-24-9-4-6-11-26(24)33-27-12-7-5-10-25(27)30/h4,6,9,11,13-16,21H,3,5,7-8,10,12,17-20H2,1-2H3,(H,32,33)(H,34,35,37)
n/an/a 97.7n/an/an/an/an/an/a
Huazhong University of Science and Technology
Curated by ChEMBL
Assay Description
Inhibition of electric eel AChE using acetylthiocholine chloride substrate incubated for 5 mins before substrate addition measured at 3 min interval ...
Bioorg Med Chem 20: 6513-22 (2012)
Article DOI: 10.1016/j.bmc.2012.08.040
BindingDB Entry DOI: 10.7270/Q20Z74DZ
Butyrylcholinesterase (BuChE)
(Equus caballus (Horse))
BDBM50393858
(CHEMBL2158122)
Show SMILES CCN(CCCNc1c2CCCCc2nc2ccccc12)CCC(=O)Nc1nc(cs1)-c1ccc(OC)cc1
Show InChI InChI=1S/C31H37N5O2S/c1-3-36(20-17-29(37)35-31-34-28(21-39-31)22-13-15-23(38-2)16-14-22)19-8-18-32-30-24-9-4-6-11-26(24)33-27-12-7-5-10-25(27)30/h4,6,9,11,13-16,21H,3,5,7-8,10,12,17-20H2,1-2H3,(H,32,33)(H,34,35,37)
n/an/a 0.479n/an/an/an/an/an/a
Huazhong University of Science and Technology
Curated by ChEMBL
Assay Description
Inhibition of equine serum BuChE using butylthiocholine chloride substrate incubated for 5 mins before substrate addition measured at 3 min interval ...
Bioorg Med Chem 20: 6513-22 (2012)
Article DOI: 10.1016/j.bmc.2012.08.040
BindingDB Entry DOI: 10.7270/Q20Z74DZ