BDBM50393860 CHEMBL2158120
SMILES: CCN(CCCCNc1c2CCCCc2nc2ccccc12)CC(=O)Nc1nc(cs1)-c1ccc(Cl)cc1
InChI Key: InChIKey=SWNXUFFUARZIDF-UHFFFAOYSA-N
Data: 2 IC50
Activity Spreadsheet -- Enzyme Inhibition Constant Data from BindingDB
Found 2 hits for monomerid = 50393860
Trg + Lig
Ki
nM
ΔG°
kcal/mole
IC50
nM
Kd
nM
EC50/IC50
nM
koff
s-1
kon
M-1s-1
pHTemp
°C
Acetylcholinesterase
(Electrophorus electricus (Electric eel))
BDBM50393860
(CHEMBL2158120)
Show SMILES CCN(CCCCNc1c2CCCCc2nc2ccccc12)CC(=O)Nc1nc(cs1)-c1ccc(Cl)cc1
Show InChI InChI=1S/C30H34ClN5OS/c1-2-36(19-28(37)35-30-34-27(20-38-30)21-13-15-22(31)16-14-21)18-8-7-17-32-29-23-9-3-5-11-25(23)33-26-12-6-4-10-24(26)29/h3,5,9,11,13-16,20H,2,4,6-8,10,12,17-19H2,1H3,(H,32,33)(H,34,35,37)
n/an/a 1.62E+3n/an/an/an/an/an/a
Huazhong University of Science and Technology
Curated by ChEMBL
Assay Description
Inhibition of electric eel AChE using acetylthiocholine chloride substrate incubated for 5 mins before substrate addition measured at 3 min interval ...
Bioorg Med Chem 20: 6513-22 (2012)
Article DOI: 10.1016/j.bmc.2012.08.040
BindingDB Entry DOI: 10.7270/Q20Z74DZ
Butyrylcholinesterase (BuChE)
(Equus caballus (Horse))
BDBM50393860
(CHEMBL2158120)
Show SMILES CCN(CCCCNc1c2CCCCc2nc2ccccc12)CC(=O)Nc1nc(cs1)-c1ccc(Cl)cc1
Show InChI InChI=1S/C30H34ClN5OS/c1-2-36(19-28(37)35-30-34-27(20-38-30)21-13-15-22(31)16-14-21)18-8-7-17-32-29-23-9-3-5-11-25(23)33-26-12-6-4-10-24(26)29/h3,5,9,11,13-16,20H,2,4,6-8,10,12,17-19H2,1H3,(H,32,33)(H,34,35,37)
n/an/a 77.6n/an/an/an/an/an/a
Huazhong University of Science and Technology
Curated by ChEMBL
Assay Description
Inhibition of equine serum BuChE using butylthiocholine chloride substrate incubated for 5 mins before substrate addition measured at 3 min interval ...
Bioorg Med Chem 20: 6513-22 (2012)
Article DOI: 10.1016/j.bmc.2012.08.040
BindingDB Entry DOI: 10.7270/Q20Z74DZ