BDBM50393870 CHEMBL2158110
SMILES: O=C(CCC(=O)Nc1nc(cs1)-c1ccccc1)NCCCCNc1c2CCCCc2nc2ccccc12
InChI Key: InChIKey=HBKRQZPHQINADC-UHFFFAOYSA-N
Data: 2 IC50
Activity Spreadsheet -- Enzyme Inhibition Constant Data from BindingDB
Found 2 hits for monomerid = 50393870
Trg + Lig
Ki
nM
ΔG°
kcal/mole
IC50
nM
Kd
nM
EC50/IC50
nM
koff
s-1
kon
M-1s-1
pHTemp
°C
Acetylcholinesterase
(Electrophorus electricus (Electric eel))
BDBM50393870
(CHEMBL2158110)
Show SMILES O=C(CCC(=O)Nc1nc(cs1)-c1ccccc1)NCCCCNc1c2CCCCc2nc2ccccc12
Show InChI InChI=1S/C30H33N5O2S/c36-27(16-17-28(37)35-30-34-26(20-38-30)21-10-2-1-3-11-21)31-18-8-9-19-32-29-22-12-4-6-14-24(22)33-25-15-7-5-13-23(25)29/h1-4,6,10-12,14,20H,5,7-9,13,15-19H2,(H,31,36)(H,32,33)(H,34,35,37)
n/an/a 490n/an/an/an/an/an/a
Huazhong University of Science and Technology
Curated by ChEMBL
Assay Description
Inhibition of electric eel AChE using acetylthiocholine chloride substrate incubated for 5 mins before substrate addition measured at 3 min interval ...
Bioorg Med Chem 20: 6513-22 (2012)
Article DOI: 10.1016/j.bmc.2012.08.040
BindingDB Entry DOI: 10.7270/Q20Z74DZ
Butyrylcholinesterase (BuChE)
(Equus caballus (Horse))
BDBM50393870
(CHEMBL2158110)
Show SMILES O=C(CCC(=O)Nc1nc(cs1)-c1ccccc1)NCCCCNc1c2CCCCc2nc2ccccc12
Show InChI InChI=1S/C30H33N5O2S/c36-27(16-17-28(37)35-30-34-26(20-38-30)21-10-2-1-3-11-21)31-18-8-9-19-32-29-22-12-4-6-14-24(22)33-25-15-7-5-13-23(25)29/h1-4,6,10-12,14,20H,5,7-9,13,15-19H2,(H,31,36)(H,32,33)(H,34,35,37)
n/an/a 0.603n/an/an/an/an/an/a
Huazhong University of Science and Technology
Curated by ChEMBL
Assay Description
Inhibition of equine serum BuChE using butylthiocholine chloride substrate incubated for 5 mins before substrate addition measured at 3 min interval ...
Bioorg Med Chem 20: 6513-22 (2012)
Article DOI: 10.1016/j.bmc.2012.08.040
BindingDB Entry DOI: 10.7270/Q20Z74DZ