BDBM50393889 CHEMBL2158252
SMILES: CC(=O)N[C@@H](Cc1ccccc1)[C@H](O)CN[C@H]1CC(C)(C)Oc2ccc(CC(C)(C)C)cc12
InChI Key: InChIKey=JLDYIPLIAROYMO-CCDWMCETSA-N
Data: 1 KI  3 IC50
Activity Spreadsheet -- Enzyme Inhibition Constant Data from BindingDB
Found 4 hits for monomerid = 50393889
Trg + Lig
Ki
nM
ΔG°
kcal/mole
IC50
nM
Kd
nM
EC50/IC50
nM
koff
s-1
kon
M-1s-1
pHTemp
°C
Cathepsin D
(Homo sapiens (Human))
BDBM50393889
(CHEMBL2158252)
Show SMILES CC(=O)N[C@@H](Cc1ccccc1)[C@H](O)CN[C@H]1CC(C)(C)Oc2ccc(CC(C)(C)C)cc12 |r|
Show InChI InChI=1S/C28H40N2O3/c1-19(31)30-23(15-20-10-8-7-9-11-20)25(32)18-29-24-17-28(5,6)33-26-13-12-21(14-22(24)26)16-27(2,3)4/h7-14,23-25,29,32H,15-18H2,1-6H3,(H,30,31)/t23-,24-,25+/m0/s1
NCI pathway
Reactome pathway
120n/an/an/an/an/an/an/an/a
Medivir AB
Curated by ChEMBL
Assay Description
Inhibition of human cathepsin D using DAB-CYL-Glu-ArG-Nle-Phe-Leu-Ser-Phe-Pro-EDANS incubated for 20 mins prior to substrate addition measured after ...
Bioorg Med Chem Lett 22: 6721-7 (2012)
Article DOI: 10.1016/j.bmcl.2012.08.097
BindingDB Entry DOI: 10.7270/Q2MS3TVD
Beta-secretase 2
(Homo sapiens (Human))
BDBM50393889
(CHEMBL2158252)
Show SMILES CC(=O)N[C@@H](Cc1ccccc1)[C@H](O)CN[C@H]1CC(C)(C)Oc2ccc(CC(C)(C)C)cc12 |r|
Show InChI InChI=1S/C28H40N2O3/c1-19(31)30-23(15-20-10-8-7-9-11-20)25(32)18-29-24-17-28(5,6)33-26-13-12-21(14-22(24)26)16-27(2,3)4/h7-14,23-25,29,32H,15-18H2,1-6H3,(H,30,31)/t23-,24-,25+/m0/s1
n/an/a 4.5n/an/an/an/an/an/a
Medivir AB
Curated by ChEMBL
Assay Description
Inhibition of BACE2
Bioorg Med Chem Lett 22: 6721-7 (2012)
Article DOI: 10.1016/j.bmcl.2012.08.097
BindingDB Entry DOI: 10.7270/Q2MS3TVD
Beta-secretase 1
(Homo sapiens (Human))
BDBM50393889
(CHEMBL2158252)
Show SMILES CC(=O)N[C@@H](Cc1ccccc1)[C@H](O)CN[C@H]1CC(C)(C)Oc2ccc(CC(C)(C)C)cc12 |r|
Show InChI InChI=1S/C28H40N2O3/c1-19(31)30-23(15-20-10-8-7-9-11-20)25(32)18-29-24-17-28(5,6)33-26-13-12-21(14-22(24)26)16-27(2,3)4/h7-14,23-25,29,32H,15-18H2,1-6H3,(H,30,31)/t23-,24-,25+/m0/s1
n/an/a 11n/an/an/an/an/an/a
Medivir AB
Curated by ChEMBL
Assay Description
Inhibition of BACE1 in human HEK cells expressing APP Swedish mutant assessed as reduction in amyloid beta40 level by ELISA
Bioorg Med Chem Lett 22: 6721-7 (2012)
Article DOI: 10.1016/j.bmcl.2012.08.097
BindingDB Entry DOI: 10.7270/Q2MS3TVD
Beta-secretase 1
(Homo sapiens (Human))
BDBM50393889
(CHEMBL2158252)
Show SMILES CC(=O)N[C@@H](Cc1ccccc1)[C@H](O)CN[C@H]1CC(C)(C)Oc2ccc(CC(C)(C)C)cc12 |r|
Show InChI InChI=1S/C28H40N2O3/c1-19(31)30-23(15-20-10-8-7-9-11-20)25(32)18-29-24-17-28(5,6)33-26-13-12-21(14-22(24)26)16-27(2,3)4/h7-14,23-25,29,32H,15-18H2,1-6H3,(H,30,31)/t23-,24-,25+/m0/s1
n/an/a 12n/an/an/an/an/an/a
Medivir AB
Curated by ChEMBL
Assay Description
Inhibition of human BACE1 expressed in Escherichia coli BL21(DE3) using Eu-EVNLDAEFK as substrate incubated for 30 mins prior to substrate addition m...
Bioorg Med Chem Lett 22: 6721-7 (2012)
Article DOI: 10.1016/j.bmcl.2012.08.097
BindingDB Entry DOI: 10.7270/Q2MS3TVD