BDBM50394130 CHEMBL2158770
SMILES: OC(=O)[C@H](Cc1cccc(c1)C#N)N1CCC(CN2CCC(CC2)Oc2ccc(Cl)c(Cl)c2)CC1
InChI Key: InChIKey=QIUVHPATBGGVRR-SANMLTNESA-N
Data: 2 KI  1 IC50
Activity Spreadsheet -- Enzyme Inhibition Constant Data from BindingDB
Found 3 hits for monomerid = 50394130
Trg + Lig
Ki
nM
ΔG°
kcal/mole
IC50
nM
Kd
nM
EC50/IC50
nM
koff
s-1
kon
M-1s-1
pHTemp
°C
C-C chemokine receptor type 3
(Homo sapiens (Human))
BDBM50394130
(CHEMBL2158770)
Show SMILES OC(=O)[C@H](Cc1cccc(c1)C#N)N1CCC(CN2CCC(CC2)Oc2ccc(Cl)c(Cl)c2)CC1 |r|
Show InChI InChI=1S/C27H31Cl2N3O3/c28-24-5-4-23(16-25(24)29)35-22-8-10-31(11-9-22)18-19-6-12-32(13-7-19)26(27(33)34)15-20-2-1-3-21(14-20)17-30/h1-5,14,16,19,22,26H,6-13,15,18H2,(H,33,34)/t26-/m0/s1
Reactome pathway
19.9n/an/an/an/an/an/an/an/a
AstraZeneca
Curated by ChEMBL
Assay Description
Binding affinity to human CCR3 expressed in CHOK1 cells by radioligand displacement assay
Bioorg Med Chem Lett 22: 6694-9 (2012)
Article DOI: 10.1016/j.bmcl.2012.08.103
BindingDB Entry DOI: 10.7270/Q2Z320SD
Histamine H1 receptor
(Homo sapiens (Human))
BDBM50394130
(CHEMBL2158770)
Show SMILES OC(=O)[C@H](Cc1cccc(c1)C#N)N1CCC(CN2CCC(CC2)Oc2ccc(Cl)c(Cl)c2)CC1 |r|
Show InChI InChI=1S/C27H31Cl2N3O3/c28-24-5-4-23(16-25(24)29)35-22-8-10-31(11-9-22)18-19-6-12-32(13-7-19)26(27(33)34)15-20-2-1-3-21(14-20)17-30/h1-5,14,16,19,22,26H,6-13,15,18H2,(H,33,34)/t26-/m0/s1
Reactome pathway
25.1n/an/an/an/an/an/an/an/a
AstraZeneca
Curated by ChEMBL
Assay Description
Binding affinity to histamine H1 receptor
Bioorg Med Chem Lett 22: 6694-9 (2012)
Article DOI: 10.1016/j.bmcl.2012.08.103
BindingDB Entry DOI: 10.7270/Q2Z320SD
Potassium voltage-gated channel subfamily H member 2
(Homo sapiens (Human))
BDBM50394130
(CHEMBL2158770)
Show SMILES OC(=O)[C@H](Cc1cccc(c1)C#N)N1CCC(CN2CCC(CC2)Oc2ccc(Cl)c(Cl)c2)CC1 |r|
Show InChI InChI=1S/C27H31Cl2N3O3/c28-24-5-4-23(16-25(24)29)35-22-8-10-31(11-9-22)18-19-6-12-32(13-7-19)26(27(33)34)15-20-2-1-3-21(14-20)17-30/h1-5,14,16,19,22,26H,6-13,15,18H2,(H,33,34)/t26-/m0/s1
Reactome pathway
n/an/a 1.26E+4n/an/an/an/an/an/a
AstraZeneca
Curated by ChEMBL
Assay Description
Displacement of 3,7-Bis[2-(4-nitro[3,5-3H]phenyl)ethyl]-3,7-diazabicyclo[3.3.1]nonane from human ERG expressed in HEK cells after 3 hrs by TopCount a...
Bioorg Med Chem Lett 22: 6694-9 (2012)
Article DOI: 10.1016/j.bmcl.2012.08.103
BindingDB Entry DOI: 10.7270/Q2Z320SD