BDBM50394143 CHEMBL2158829
SMILES: OC(=O)COc1cccc(c1)N1CCC(CN2CCC(CC2)Oc2ccc(Cl)c(Cl)c2)CC1
InChI Key: InChIKey=VLUYCVQWTQUWPI-UHFFFAOYSA-N
Data: 2 KI  1 IC50
Activity Spreadsheet -- Enzyme Inhibition Constant Data from BindingDB
Found 3 hits for monomerid = 50394143
Trg + Lig
Ki
nM
ΔG°
kcal/mole
IC50
nM
Kd
nM
EC50/IC50
nM
koff
s-1
kon
M-1s-1
pHTemp
°C
Histamine H1 receptor
(Homo sapiens (Human))
BDBM50394143
(CHEMBL2158829)
Show SMILES OC(=O)COc1cccc(c1)N1CCC(CN2CCC(CC2)Oc2ccc(Cl)c(Cl)c2)CC1
Show InChI InChI=1S/C25H30Cl2N2O4/c26-23-5-4-22(15-24(23)27)33-20-8-10-28(11-9-20)16-18-6-12-29(13-7-18)19-2-1-3-21(14-19)32-17-25(30)31/h1-5,14-15,18,20H,6-13,16-17H2,(H,30,31)
Reactome pathway
5.01n/an/an/an/an/an/an/an/a
AstraZeneca
Curated by ChEMBL
Assay Description
Binding affinity to histamine H1 receptor
Bioorg Med Chem Lett 22: 6694-9 (2012)
Article DOI: 10.1016/j.bmcl.2012.08.103
BindingDB Entry DOI: 10.7270/Q2Z320SD
C-C chemokine receptor type 3
(Homo sapiens (Human))
BDBM50394143
(CHEMBL2158829)
Show SMILES OC(=O)COc1cccc(c1)N1CCC(CN2CCC(CC2)Oc2ccc(Cl)c(Cl)c2)CC1
Show InChI InChI=1S/C25H30Cl2N2O4/c26-23-5-4-22(15-24(23)27)33-20-8-10-28(11-9-20)16-18-6-12-29(13-7-18)19-2-1-3-21(14-19)32-17-25(30)31/h1-5,14-15,18,20H,6-13,16-17H2,(H,30,31)
Reactome pathway
39.8n/an/an/an/an/an/an/an/a
AstraZeneca
Curated by ChEMBL
Assay Description
Binding affinity to human CCR3 expressed in CHOK1 cells by radioligand displacement assay
Bioorg Med Chem Lett 22: 6694-9 (2012)
Article DOI: 10.1016/j.bmcl.2012.08.103
BindingDB Entry DOI: 10.7270/Q2Z320SD
Potassium voltage-gated channel subfamily H member 2
(Homo sapiens (Human))
BDBM50394143
(CHEMBL2158829)
Show SMILES OC(=O)COc1cccc(c1)N1CCC(CN2CCC(CC2)Oc2ccc(Cl)c(Cl)c2)CC1
Show InChI InChI=1S/C25H30Cl2N2O4/c26-23-5-4-22(15-24(23)27)33-20-8-10-28(11-9-20)16-18-6-12-29(13-7-18)19-2-1-3-21(14-19)32-17-25(30)31/h1-5,14-15,18,20H,6-13,16-17H2,(H,30,31)
Reactome pathway
n/an/a 1.00E+4n/an/an/an/an/an/a
AstraZeneca
Curated by ChEMBL
Assay Description
Displacement of 3,7-Bis[2-(4-nitro[3,5-3H]phenyl)ethyl]-3,7-diazabicyclo[3.3.1]nonane from human ERG expressed in HEK cells after 3 hrs by TopCount a...
Bioorg Med Chem Lett 22: 6694-9 (2012)
Article DOI: 10.1016/j.bmcl.2012.08.103
BindingDB Entry DOI: 10.7270/Q2Z320SD