BDBM50394174 CHEMBL2158863
SMILES: CCN(CC)S(=O)(=O)c1cc(Nc2nccc(n2)-c2ccnc(c2)-c2ccc(NC(=O)NC)cc2)ccc1C
InChI Key: InChIKey=YKVXFJUHOCXIAS-UHFFFAOYSA-N
Data: 6 IC50
Activity Spreadsheet -- Enzyme Inhibition Constant Data from BindingDB
Found 6 hits for monomerid = 50394174
Trg + Lig
Ki
nM
ΔG°
kcal/mole
IC50
nM
Kd
nM
EC50/IC50
nM
koff
s-1
kon
M-1s-1
pHTemp
°C
Cyclin-dependent kinase 1
(Homo sapiens (Human))
BDBM50394174
(CHEMBL2158863)
Show SMILES CCN(CC)S(=O)(=O)c1cc(Nc2nccc(n2)-c2ccnc(c2)-c2ccc(NC(=O)NC)cc2)ccc1C
Show InChI InChI=1S/C28H31N7O3S/c1-5-35(6-2)39(37,38)26-18-23(10-7-19(26)3)32-27-31-16-14-24(34-27)21-13-15-30-25(17-21)20-8-11-22(12-9-20)33-28(36)29-4/h7-18H,5-6H2,1-4H3,(H2,29,33,36)(H,31,32,34)
Reactome pathway
n/an/a 1.40E+4n/an/an/an/an/an/a
Pfizer Inc.
Curated by ChEMBL
Assay Description
Inhibition of CDK1
Bioorg Med Chem Lett 22: 6636-41 (2012)
Article DOI: 10.1016/j.bmcl.2012.08.107
BindingDB Entry DOI: 10.7270/Q2TB181N
Serine/threonine-protein kinase mTOR
(Homo sapiens (Human))
BDBM50394174
(CHEMBL2158863)
Show SMILES CCN(CC)S(=O)(=O)c1cc(Nc2nccc(n2)-c2ccnc(c2)-c2ccc(NC(=O)NC)cc2)ccc1C
Show InChI InChI=1S/C28H31N7O3S/c1-5-35(6-2)39(37,38)26-18-23(10-7-19(26)3)32-27-31-16-14-24(34-27)21-13-15-30-25(17-21)20-8-11-22(12-9-20)33-28(36)29-4/h7-18H,5-6H2,1-4H3,(H2,29,33,36)(H,31,32,34)
NCI pathway
Reactome pathway
n/an/a 88n/an/an/an/an/an/a
Pfizer Inc.
Curated by ChEMBL
Assay Description
Inhibition of mTOR
Bioorg Med Chem Lett 22: 6636-41 (2012)
Article DOI: 10.1016/j.bmcl.2012.08.107
BindingDB Entry DOI: 10.7270/Q2TB181N
Phosphatidylinositol 4,5-bisphosphate 3-kinase catalytic subunit gamma isoform
(Homo sapiens (Human))
BDBM50394174
(CHEMBL2158863)
Show SMILES CCN(CC)S(=O)(=O)c1cc(Nc2nccc(n2)-c2ccnc(c2)-c2ccc(NC(=O)NC)cc2)ccc1C
Show InChI InChI=1S/C28H31N7O3S/c1-5-35(6-2)39(37,38)26-18-23(10-7-19(26)3)32-27-31-16-14-24(34-27)21-13-15-30-25(17-21)20-8-11-22(12-9-20)33-28(36)29-4/h7-18H,5-6H2,1-4H3,(H2,29,33,36)(H,31,32,34)
NCI pathway
Reactome pathway
n/an/a 93n/an/an/an/an/an/a
Pfizer Inc.
Curated by ChEMBL
Assay Description
Inhibition of PI3Kgamma using diC8-tagged PIP2 as substrate after 30 to 60 mins by TAMRA-based fluorescence polarization assay
Bioorg Med Chem Lett 22: 6636-41 (2012)
Article DOI: 10.1016/j.bmcl.2012.08.107
BindingDB Entry DOI: 10.7270/Q2TB181N
Cyclin-dependent kinase 2
(Homo sapiens (Human))
BDBM50394174
(CHEMBL2158863)
Show SMILES CCN(CC)S(=O)(=O)c1cc(Nc2nccc(n2)-c2ccnc(c2)-c2ccc(NC(=O)NC)cc2)ccc1C
Show InChI InChI=1S/C28H31N7O3S/c1-5-35(6-2)39(37,38)26-18-23(10-7-19(26)3)32-27-31-16-14-24(34-27)21-13-15-30-25(17-21)20-8-11-22(12-9-20)33-28(36)29-4/h7-18H,5-6H2,1-4H3,(H2,29,33,36)(H,31,32,34)
NCI pathway
Reactome pathway
n/an/a 3.00E+3n/an/an/an/an/an/a
Pfizer Inc.
Curated by ChEMBL
Assay Description
Inhibition of CDK2
Bioorg Med Chem Lett 22: 6636-41 (2012)
Article DOI: 10.1016/j.bmcl.2012.08.107
BindingDB Entry DOI: 10.7270/Q2TB181N
Phosphatidylinositol 4,5-bisphosphate 3-kinase catalytic subunit alpha isoform
(Homo sapiens (Human))
BDBM50394174
(CHEMBL2158863)
Show SMILES CCN(CC)S(=O)(=O)c1cc(Nc2nccc(n2)-c2ccnc(c2)-c2ccc(NC(=O)NC)cc2)ccc1C
Show InChI InChI=1S/C28H31N7O3S/c1-5-35(6-2)39(37,38)26-18-23(10-7-19(26)3)32-27-31-16-14-24(34-27)21-13-15-30-25(17-21)20-8-11-22(12-9-20)33-28(36)29-4/h7-18H,5-6H2,1-4H3,(H2,29,33,36)(H,31,32,34)
NCI pathway
Reactome pathway
n/an/a 130n/an/an/an/an/an/a
Pfizer Inc.
Curated by ChEMBL
Assay Description
Inhibition of PI3Kalpha using diC8-tagged PIP2 as substrate after 30 to 60 mins by TAMRA-based fluorescence polarization assay
Bioorg Med Chem Lett 22: 6636-41 (2012)
Article DOI: 10.1016/j.bmcl.2012.08.107
BindingDB Entry DOI: 10.7270/Q2TB181N
Serine/threonine-protein kinase SMG1
(Homo sapiens (Human))
BDBM50394174
(CHEMBL2158863)
Show SMILES CCN(CC)S(=O)(=O)c1cc(Nc2nccc(n2)-c2ccnc(c2)-c2ccc(NC(=O)NC)cc2)ccc1C
Show InChI InChI=1S/C28H31N7O3S/c1-5-35(6-2)39(37,38)26-18-23(10-7-19(26)3)32-27-31-16-14-24(34-27)21-13-15-30-25(17-21)20-8-11-22(12-9-20)33-28(36)29-4/h7-18H,5-6H2,1-4H3,(H2,29,33,36)(H,31,32,34)
Reactome pathway
n/an/a 0.200n/an/an/an/an/an/a
Pfizer Inc.
Curated by ChEMBL
Assay Description
Inhibition of human recombinant SMG1 expressed in HEK293 cells using GST-tagged p53 as substrate after 1 hr by DELFIA assay
Bioorg Med Chem Lett 22: 6636-41 (2012)
Article DOI: 10.1016/j.bmcl.2012.08.107
BindingDB Entry DOI: 10.7270/Q2TB181N