BDBM50394181 CHEMBL2158857
SMILES: NS(=O)(=O)c1cccc(Nc2nccc(n2)-c2ccnc(c2)N2CCCCC2)c1
InChI Key: InChIKey=CZDONRYGQBBPBK-UHFFFAOYSA-N
Data: 4 IC50
Activity Spreadsheet -- Enzyme Inhibition Constant Data from BindingDB
Found 4 hits for monomerid = 50394181
Trg + Lig
Ki
nM
ΔG°
kcal/mole
IC50
nM
Kd
nM
EC50/IC50
nM
koff
s-1
kon
M-1s-1
pHTemp
°C
Cyclin-dependent kinase 1
(Homo sapiens (Human))
BDBM50394181
(CHEMBL2158857)
Show SMILES NS(=O)(=O)c1cccc(Nc2nccc(n2)-c2ccnc(c2)N2CCCCC2)c1
Show InChI InChI=1S/C20H22N6O2S/c21-29(27,28)17-6-4-5-16(14-17)24-20-23-10-8-18(25-20)15-7-9-22-19(13-15)26-11-2-1-3-12-26/h4-10,13-14H,1-3,11-12H2,(H2,21,27,28)(H,23,24,25)
Reactome pathway
n/an/a 36n/an/an/an/an/an/a
Pfizer Inc.
Curated by ChEMBL
Assay Description
Inhibition of CDK1
Bioorg Med Chem Lett 22: 6636-41 (2012)
Article DOI: 10.1016/j.bmcl.2012.08.107
BindingDB Entry DOI: 10.7270/Q2TB181N
Serine/threonine-protein kinase mTOR
(Homo sapiens (Human))
BDBM50394181
(CHEMBL2158857)
Show SMILES NS(=O)(=O)c1cccc(Nc2nccc(n2)-c2ccnc(c2)N2CCCCC2)c1
Show InChI InChI=1S/C20H22N6O2S/c21-29(27,28)17-6-4-5-16(14-17)24-20-23-10-8-18(25-20)15-7-9-22-19(13-15)26-11-2-1-3-12-26/h4-10,13-14H,1-3,11-12H2,(H2,21,27,28)(H,23,24,25)
NCI pathway
Reactome pathway
n/an/a 140n/an/an/an/an/an/a
Pfizer Inc.
Curated by ChEMBL
Assay Description
Inhibition of mTOR
Bioorg Med Chem Lett 22: 6636-41 (2012)
Article DOI: 10.1016/j.bmcl.2012.08.107
BindingDB Entry DOI: 10.7270/Q2TB181N
Serine/threonine-protein kinase SMG1
(Homo sapiens (Human))
BDBM50394181
(CHEMBL2158857)
Show SMILES NS(=O)(=O)c1cccc(Nc2nccc(n2)-c2ccnc(c2)N2CCCCC2)c1
Show InChI InChI=1S/C20H22N6O2S/c21-29(27,28)17-6-4-5-16(14-17)24-20-23-10-8-18(25-20)15-7-9-22-19(13-15)26-11-2-1-3-12-26/h4-10,13-14H,1-3,11-12H2,(H2,21,27,28)(H,23,24,25)
Reactome pathway
n/an/a 3n/an/an/an/an/an/a
Pfizer Inc.
Curated by ChEMBL
Assay Description
Inhibition of human recombinant SMG1 expressed in HEK293 cells using GST-tagged p53 as substrate after 1 hr by DELFIA assay
Bioorg Med Chem Lett 22: 6636-41 (2012)
Article DOI: 10.1016/j.bmcl.2012.08.107
BindingDB Entry DOI: 10.7270/Q2TB181N
Cyclin-dependent kinase 2
(Homo sapiens (Human))
BDBM50394181
(CHEMBL2158857)
Show SMILES NS(=O)(=O)c1cccc(Nc2nccc(n2)-c2ccnc(c2)N2CCCCC2)c1
Show InChI InChI=1S/C20H22N6O2S/c21-29(27,28)17-6-4-5-16(14-17)24-20-23-10-8-18(25-20)15-7-9-22-19(13-15)26-11-2-1-3-12-26/h4-10,13-14H,1-3,11-12H2,(H2,21,27,28)(H,23,24,25)
NCI pathway
Reactome pathway
n/an/a 16n/an/an/an/an/an/a
Pfizer Inc.
Curated by ChEMBL
Assay Description
Inhibition of CDK2
Bioorg Med Chem Lett 22: 6636-41 (2012)
Article DOI: 10.1016/j.bmcl.2012.08.107
BindingDB Entry DOI: 10.7270/Q2TB181N