null
SMILES: OC[C@H]1O[C@@H](O[C@H](CCc2ccc(O)c(O)c2)C[C@H](O)CCc2ccc(O)c(O)c2)[C@H](O)[C@@H](O)[C@@H]1O
InChI Key: InChIKey=RMPZSLTVINHQDZ-NWKFWMDCSA-N
Activity Spreadsheet -- Enzyme Inhibition Constant Data from BindingDB
Found 3 hits for monomerid = 50394341
Trg + Lig
Ki
nM
ΔG°
kcal/mole
IC50
nM
Kd
nM
EC50/IC50
nM
koff
s-1
kon
M-1s-1
pHTemp
°C
Peroxisome proliferator-activated receptor delta
(Homo sapiens (Human))
BDBM50394341
(CHEMBL465800)
Show SMILES OC[C@H]1O[C@@H](O[C@H](CCc2ccc(O)c(O)c2)C[C@H](O)CCc2ccc(O)c(O)c2)[C@H](O)[C@@H](O)[C@@H]1O |r|
Show InChI InChI=1S/C25H34O11/c26-12-21-22(32)23(33)24(34)25(36-21)35-16(6-2-14-4-8-18(29)20(31)10-14)11-15(27)5-1-13-3-7-17(28)19(30)9-13/h3-4,7-10,15-16,21-34H,1-2,5-6,11-12H2/t15-,16-,21-,22-,23+,24-,25-/m1/s1
n/an/an/an/a 2.31E+4n/an/an/an/a
Chungnam National University
Curated by ChEMBL
Assay Description
Transactivation of GAL4-fused PPARbeta (delta) ligand binding domain transfected in human HepG2 cells after 20 hrs by luciferase reporter gene assay
Bioorg Med Chem Lett 22: 6681-7 (2012)
Article DOI: 10.1016/j.bmcl.2012.08.099
BindingDB Entry DOI: 10.7270/Q28C9XCD
Peroxisome proliferator-activated receptor alpha
(Homo sapiens (Human))
BDBM50394341
(CHEMBL465800)
Show SMILES OC[C@H]1O[C@@H](O[C@H](CCc2ccc(O)c(O)c2)C[C@H](O)CCc2ccc(O)c(O)c2)[C@H](O)[C@@H](O)[C@@H]1O |r|
Show InChI InChI=1S/C25H34O11/c26-12-21-22(32)23(33)24(34)25(36-21)35-16(6-2-14-4-8-18(29)20(31)10-14)11-15(27)5-1-13-3-7-17(28)19(30)9-13/h3-4,7-10,15-16,21-34H,1-2,5-6,11-12H2/t15-,16-,21-,22-,23+,24-,25-/m1/s1
n/an/an/an/a>5.00E+4n/an/an/an/a
Chungnam National University
Curated by ChEMBL
Assay Description
Transactivation of GAL4-fused PPARalpha ligand binding domain transfected in human HepG2 cells after 20 hrs by luciferase reporter gene assay
Bioorg Med Chem Lett 22: 6681-7 (2012)
Article DOI: 10.1016/j.bmcl.2012.08.099
BindingDB Entry DOI: 10.7270/Q28C9XCD
Peroxisome proliferator-activated receptor gamma
(Homo sapiens (Human))
BDBM50394341
(CHEMBL465800)
Show SMILES OC[C@H]1O[C@@H](O[C@H](CCc2ccc(O)c(O)c2)C[C@H](O)CCc2ccc(O)c(O)c2)[C@H](O)[C@@H](O)[C@@H]1O |r|
Show InChI InChI=1S/C25H34O11/c26-12-21-22(32)23(33)24(34)25(36-21)35-16(6-2-14-4-8-18(29)20(31)10-14)11-15(27)5-1-13-3-7-17(28)19(30)9-13/h3-4,7-10,15-16,21-34H,1-2,5-6,11-12H2/t15-,16-,21-,22-,23+,24-,25-/m1/s1
NCI pathway
Reactome pathway
n/an/an/an/a>5.00E+4n/an/an/an/a
Chungnam National University
Curated by ChEMBL
Assay Description
Transactivation of GAL4-fused PPARgamma ligand binding domain transfected in human HepG2 cells after 20 hrs by luciferase reporter gene assay
Bioorg Med Chem Lett 22: 6681-7 (2012)
Article DOI: 10.1016/j.bmcl.2012.08.099
BindingDB Entry DOI: 10.7270/Q28C9XCD