BDBM50394593 CHEMBL2164205
SMILES: C[C@H](CCNC(=O)c1c(C)cc(Cl)nc1C)N1CCC(CC1)N(Cc1ccsc1)C(=O)NO
InChI Key: InChIKey=YKXXIIVYICOTPX-MRXNPFEDSA-N
Data: 1 IC50
Activity Spreadsheet -- Enzyme Inhibition Constant Data from BindingDB
Found 1 hit for monomerid = 50394593
Trg + Lig
Ki
nM
ΔG°
kcal/mole
IC50
nM
Kd
nM
EC50/IC50
nM
koff
s-1
kon
M-1s-1
pHTemp
°C
C-C chemokine receptor type 5
(Homo sapiens (Human))
BDBM50394593
(CHEMBL2164205)
Show SMILES C[C@H](CCNC(=O)c1c(C)cc(Cl)nc1C)N1CCC(CC1)N(Cc1ccsc1)C(=O)NO |r|
Show InChI InChI=1S/C23H32ClN5O3S/c1-15-12-20(24)26-17(3)21(15)22(30)25-8-4-16(2)28-9-5-19(6-10-28)29(23(31)27-32)13-18-7-11-33-14-18/h7,11-12,14,16,19,32H,4-6,8-10,13H2,1-3H3,(H,25,30)(H,27,31)/t16-/m1/s1
n/an/a 0.300n/an/an/an/an/an/a
TBA
Curated by ChEMBL
Assay Description
Antagonist activity at CCR5 receptor expressed in P4R5 cells co-expressing CD4, and LTR-beta-gal construct assessed as inhibition of infusion to HIV ...
ACS Med Chem Lett 3: 216-221 (2012)
Article DOI: 10.1021/ml2002604
BindingDB Entry DOI: 10.7270/Q2T43V6M