BDBM50394601 CHEMBL2164217
SMILES: C[C@H](CCNC(=O)c1c(C)cc(Cl)nc1C)N1CCC(CC1)N(Cc1ccsc1)C(=O)Nc1cccnc1
InChI Key: InChIKey=BNNGWNXPMYMWRI-HXUWFJFHSA-N
Data: 1 IC50
Activity Spreadsheet -- Enzyme Inhibition Constant Data from BindingDB
Found 1 hit for monomerid = 50394601
Trg + Lig
Ki
nM
ΔG°
kcal/mole
IC50
nM
Kd
nM
EC50/IC50
nM
koff
s-1
kon
M-1s-1
pHTemp
°C
C-C chemokine receptor type 5
(Homo sapiens (Human))
BDBM50394601
(CHEMBL2164217)
Show SMILES C[C@H](CCNC(=O)c1c(C)cc(Cl)nc1C)N1CCC(CC1)N(Cc1ccsc1)C(=O)Nc1cccnc1 |r|
Show InChI InChI=1S/C28H35ClN6O2S/c1-19-15-25(29)32-21(3)26(19)27(36)31-11-6-20(2)34-12-7-24(8-13-34)35(17-22-9-14-38-18-22)28(37)33-23-5-4-10-30-16-23/h4-5,9-10,14-16,18,20,24H,6-8,11-13,17H2,1-3H3,(H,31,36)(H,33,37)/t20-/m1/s1
n/an/a 0.110n/an/an/an/an/an/a
TBA
Curated by ChEMBL
Assay Description
Antagonist activity at CCR5 receptor expressed in P4R5 cells co-expressing CD4, and LTR-beta-gal construct assessed as inhibition of infusion to HIV ...
ACS Med Chem Lett 3: 216-221 (2012)
Article DOI: 10.1021/ml2002604
BindingDB Entry DOI: 10.7270/Q2T43V6M