BDBM50394695 CHEMBL2165635
SMILES: Cc1nc(N)sc1CCCNC(=N)NC(=O)CCCCCCCCCCCCCCCCCCCCC(=O)NC(N)=NCCCc1sc(N)nc1C
InChI Key: InChIKey=FHMVVEHBSVRZTG-UHFFFAOYSA-N
Data: 2 EC50
Activity Spreadsheet -- Enzyme Inhibition Constant Data from BindingDB
Found 2 hits for monomerid = 50394695
Trg + Lig
Ki
nM
ΔG°
kcal/mole
IC50
nM
Kd
nM
EC50/IC50
nM
koff
s-1
kon
M-1s-1
pHTemp
°C
Histamine H2 receptor
(Cavia porcellus (domestic guinea pig))
BDBM50394695
(CHEMBL2165635)
Show SMILES Cc1nc(N)sc1CCCNC(=N)NC(=O)CCCCCCCCCCCCCCCCCCCCC(=O)NC(N)=NCCCc1sc(N)nc1C |w:41.42|
Show InChI InChI=1S/C38H68N10O2S2/c1-29-31(51-37(41)45-29)23-21-27-43-35(39)47-33(49)25-19-17-15-13-11-9-7-5-3-4-6-8-10-12-14-16-18-20-26-34(50)48-36(40)44-28-22-24-32-30(2)46-38(42)52-32/h3-28H2,1-2H3,(H2,41,45)(H2,42,46)(H3,39,43,47,49)(H3,40,44,48,50)
n/an/an/an/a 331n/an/an/an/a
University of Regensburg
Curated by ChEMBL
Assay Description
Agonist activity at guinea pig H2R-Gsalphas expressed in Sf9 cells at 0.1 nM to 10 uM by steady state GTPase activity assay
J Med Chem 55: 1147-60 (2012)
Article DOI: 10.1021/jm201128q
BindingDB Entry DOI: 10.7270/Q2HQ411W
Histamine H2 receptor
(Cavia porcellus (domestic guinea pig))
BDBM50394695
(CHEMBL2165635)
Show SMILES Cc1nc(N)sc1CCCNC(=N)NC(=O)CCCCCCCCCCCCCCCCCCCCC(=O)NC(N)=NCCCc1sc(N)nc1C |w:41.42|
Show InChI InChI=1S/C38H68N10O2S2/c1-29-31(51-37(41)45-29)23-21-27-43-35(39)47-33(49)25-19-17-15-13-11-9-7-5-3-4-6-8-10-12-14-16-18-20-26-34(50)48-36(40)44-28-22-24-32-30(2)46-38(42)52-32/h3-28H2,1-2H3,(H2,41,45)(H2,42,46)(H3,39,43,47,49)(H3,40,44,48,50)
n/an/an/an/a 7.94E+3n/an/an/an/a
University of Regensburg
Curated by ChEMBL
Assay Description
Agonist activity at H2R in spontaneously beating guinea pig right atrium assessed as increase in heart rate
J Med Chem 55: 1147-60 (2012)
Article DOI: 10.1021/jm201128q
BindingDB Entry DOI: 10.7270/Q2HQ411W