BDBM50394776 CHEMBL2163388
SMILES: Cc1cc(Nc2nc(Sc3ccc(NC(=O)CN4CC[C@H](C4)C(=O)NCC(F)(F)F)cc3)nn3cccc23)n[nH]1
InChI Key: InChIKey=VBXXGYSKTLTOBL-MRXNPFEDSA-N
Data: 1 IC50  2 Kd
Activity Spreadsheet -- Enzyme Inhibition Constant Data from BindingDB
Found 3 hits for monomerid = 50394776
Trg + Lig
Ki
nM
ΔG°
kcal/mole
IC50
nM
Kd
nM
EC50/IC50
nM
koff
s-1
kon
M-1s-1
pHTemp
°C
Aurora kinase B
(Homo sapiens (Human))
BDBM50394776
(CHEMBL2163388)
Show SMILES Cc1cc(Nc2nc(Sc3ccc(NC(=O)CN4CC[C@H](C4)C(=O)NCC(F)(F)F)cc3)nn3cccc23)n[nH]1 |r|
Show InChI InChI=1S/C25H26F3N9O2S/c1-15-11-20(34-33-15)31-22-19-3-2-9-37(19)35-24(32-22)40-18-6-4-17(5-7-18)30-21(38)13-36-10-8-16(12-36)23(39)29-14-25(26,27)28/h2-7,9,11,16H,8,10,12-14H2,1H3,(H,29,39)(H,30,38)(H2,31,32,33,34,35)/t16-/m1/s1
Reactome pathway
n/an/an/a 2.20n/an/an/an/an/a
Ambit Biosciences Corporation
Curated by ChEMBL
Assay Description
Binding affinity to Aurora kinase B catalytic domain by competition binding assay
J Med Chem 55: 3250-60 (2012)
Article DOI: 10.1021/jm201702g
BindingDB Entry DOI: 10.7270/Q2W0971F
Aurora kinase A
(Homo sapiens (Human))
BDBM50394776
(CHEMBL2163388)
Show SMILES Cc1cc(Nc2nc(Sc3ccc(NC(=O)CN4CC[C@H](C4)C(=O)NCC(F)(F)F)cc3)nn3cccc23)n[nH]1 |r|
Show InChI InChI=1S/C25H26F3N9O2S/c1-15-11-20(34-33-15)31-22-19-3-2-9-37(19)35-24(32-22)40-18-6-4-17(5-7-18)30-21(38)13-36-10-8-16(12-36)23(39)29-14-25(26,27)28/h2-7,9,11,16H,8,10,12-14H2,1H3,(H,29,39)(H,30,38)(H2,31,32,33,34,35)/t16-/m1/s1
NCI pathway
Reactome pathway
n/an/an/a 2.5n/an/an/an/an/a
Ambit Biosciences Corporation
Curated by ChEMBL
Assay Description
Inhibition of Aurora kinase A autophosphorylation in human HEK293 cells after 2 hrs by phosphor antibody readout assay
J Med Chem 55: 3250-60 (2012)
Article DOI: 10.1021/jm201702g
BindingDB Entry DOI: 10.7270/Q2W0971F
Aurora kinase B
(Homo sapiens (Human))
BDBM50394776
(CHEMBL2163388)
Show SMILES Cc1cc(Nc2nc(Sc3ccc(NC(=O)CN4CC[C@H](C4)C(=O)NCC(F)(F)F)cc3)nn3cccc23)n[nH]1 |r|
Show InChI InChI=1S/C25H26F3N9O2S/c1-15-11-20(34-33-15)31-22-19-3-2-9-37(19)35-24(32-22)40-18-6-4-17(5-7-18)30-21(38)13-36-10-8-16(12-36)23(39)29-14-25(26,27)28/h2-7,9,11,16H,8,10,12-14H2,1H3,(H,29,39)(H,30,38)(H2,31,32,33,34,35)/t16-/m1/s1
Reactome pathway
n/an/a 7n/an/an/an/an/an/a
Ambit Biosciences Corporation
Curated by ChEMBL
Assay Description
Inhibition of Aurora kinase B-mediated histone H3 Ser10 phosphorylation in human HCT116 cells after 2 hrs by sandwich ELISA
J Med Chem 55: 3250-60 (2012)
Article DOI: 10.1021/jm201702g
BindingDB Entry DOI: 10.7270/Q2W0971F