BDBM50394798 CHEMBL2163408
SMILES: COCCO[C@@H]1CCN(CC(=O)Nc2ccc(Sc3nc(Nc4cc(C)[nH]n4)c4cccn4n3)cc2)C1
InChI Key: InChIKey=DIZTWKKXOXSRQF-LJQANCHMSA-N
Data: 1 IC50  2 Kd
Activity Spreadsheet -- Enzyme Inhibition Constant Data from BindingDB
Found 3 hits for monomerid = 50394798
Trg + Lig
Ki
nM
ΔG°
kcal/mole
IC50
nM
Kd
nM
EC50/IC50
nM
koff
s-1
kon
M-1s-1
pHTemp
°C
Aurora kinase B
(Homo sapiens (Human))
BDBM50394798
(CHEMBL2163408)
Show SMILES COCCO[C@@H]1CCN(CC(=O)Nc2ccc(Sc3nc(Nc4cc(C)[nH]n4)c4cccn4n3)cc2)C1 |r|
Show InChI InChI=1S/C25H30N8O3S/c1-17-14-22(30-29-17)27-24-21-4-3-10-33(21)31-25(28-24)37-20-7-5-18(6-8-20)26-23(34)16-32-11-9-19(15-32)36-13-12-35-2/h3-8,10,14,19H,9,11-13,15-16H2,1-2H3,(H,26,34)(H2,27,28,29,30,31)/t19-/m1/s1
Reactome pathway
n/an/a 6.20n/an/an/an/an/an/a
Ambit Biosciences Corporation
Curated by ChEMBL
Assay Description
Inhibition of Aurora kinase B-mediated histone H3 Ser10 phosphorylation in human HCT116 cells after 2 hrs by sandwich ELISA
J Med Chem 55: 3250-60 (2012)
Article DOI: 10.1021/jm201702g
BindingDB Entry DOI: 10.7270/Q2W0971F
Aurora kinase A
(Homo sapiens (Human))
BDBM50394798
(CHEMBL2163408)
Show SMILES COCCO[C@@H]1CCN(CC(=O)Nc2ccc(Sc3nc(Nc4cc(C)[nH]n4)c4cccn4n3)cc2)C1 |r|
Show InChI InChI=1S/C25H30N8O3S/c1-17-14-22(30-29-17)27-24-21-4-3-10-33(21)31-25(28-24)37-20-7-5-18(6-8-20)26-23(34)16-32-11-9-19(15-32)36-13-12-35-2/h3-8,10,14,19H,9,11-13,15-16H2,1-2H3,(H,26,34)(H2,27,28,29,30,31)/t19-/m1/s1
NCI pathway
Reactome pathway
n/an/an/a 12n/an/an/an/an/a
Ambit Biosciences Corporation
Curated by ChEMBL
Assay Description
Inhibition of Aurora kinase A autophosphorylation in human HEK293 cells after 2 hrs by phosphor antibody readout assay
J Med Chem 55: 3250-60 (2012)
Article DOI: 10.1021/jm201702g
BindingDB Entry DOI: 10.7270/Q2W0971F
Aurora kinase B
(Homo sapiens (Human))
BDBM50394798
(CHEMBL2163408)
Show SMILES COCCO[C@@H]1CCN(CC(=O)Nc2ccc(Sc3nc(Nc4cc(C)[nH]n4)c4cccn4n3)cc2)C1 |r|
Show InChI InChI=1S/C25H30N8O3S/c1-17-14-22(30-29-17)27-24-21-4-3-10-33(21)31-25(28-24)37-20-7-5-18(6-8-20)26-23(34)16-32-11-9-19(15-32)36-13-12-35-2/h3-8,10,14,19H,9,11-13,15-16H2,1-2H3,(H,26,34)(H2,27,28,29,30,31)/t19-/m1/s1
Reactome pathway
n/an/an/a 3.10n/an/an/an/an/a
Ambit Biosciences Corporation
Curated by ChEMBL
Assay Description
Binding affinity to Aurora kinase B catalytic domain by competition binding assay
J Med Chem 55: 3250-60 (2012)
Article DOI: 10.1021/jm201702g
BindingDB Entry DOI: 10.7270/Q2W0971F