BDBM50394915 CHEMBL2165507
SMILES: CC(C)(N1CCN(Cc2cc3nc(nc(N4CCOCC4)c3s2)-c2cc(cc3[nH]ccc23)C#N)CC1)C(N)=O
InChI Key: InChIKey=QMOQTGNDEOUYLC-UHFFFAOYSA-N
Data: 2 IC50
Activity Spreadsheet -- Enzyme Inhibition Constant Data from BindingDB
Found 2 hits for monomerid = 50394915
Trg + Lig
Ki
nM
ΔG°
kcal/mole
IC50
nM
Kd
nM
EC50/IC50
nM
koff
s-1
kon
M-1s-1
pHTemp
°C
Cytochrome P450 3A4
(Homo sapiens (Human))
BDBM50394915
(CHEMBL2165507)
Show SMILES CC(C)(N1CCN(Cc2cc3nc(nc(N4CCOCC4)c3s2)-c2cc(cc3[nH]ccc23)C#N)CC1)C(N)=O
Show InChI InChI=1S/C28H32N8O2S/c1-28(2,27(30)37)36-7-5-34(6-8-36)17-19-15-23-24(39-19)26(35-9-11-38-12-10-35)33-25(32-23)21-13-18(16-29)14-22-20(21)3-4-31-22/h3-4,13-15,31H,5-12,17H2,1-2H3,(H2,30,37)
Reactome pathway
n/an/a 1.20E+3n/an/an/an/an/an/a
Genentech
Curated by ChEMBL
Assay Description
Time dependent inhibition of CYP3A4 in human liver microsomes preincubated for 30 mins
J Med Chem 55: 5887-900 (2012)
Article DOI: 10.1021/jm3003747
BindingDB Entry DOI: 10.7270/Q2V125XN
Phosphatidylinositol 4,5-bisphosphate 3-kinase catalytic subunit delta isoform
(Homo sapiens (Human))
BDBM50394915
(CHEMBL2165507)
Show SMILES CC(C)(N1CCN(Cc2cc3nc(nc(N4CCOCC4)c3s2)-c2cc(cc3[nH]ccc23)C#N)CC1)C(N)=O
Show InChI InChI=1S/C28H32N8O2S/c1-28(2,27(30)37)36-7-5-34(6-8-36)17-19-15-23-24(39-19)26(35-9-11-38-12-10-35)33-25(32-23)21-13-18(16-29)14-22-20(21)3-4-31-22/h3-4,13-15,31H,5-12,17H2,1-2H3,(H2,30,37)
NCI pathway
Reactome pathway
n/an/a 3.20n/an/an/an/an/an/a
Genentech
Curated by ChEMBL
Assay Description
Binding affinity to PI3Kdelta after 30 mins by competitive fluorescence polarization assay
J Med Chem 55: 5887-900 (2012)
Article DOI: 10.1021/jm3003747
BindingDB Entry DOI: 10.7270/Q2V125XN